{"text_format":"1","workbook":"xlsx","n_sheets":12,"sheets":["PRINCIPAL","Componentes","Tecno","TabProd","EucPol1Rot","EucPol2Rot","EucEne1Rot","EucEne2Rot","EucEne3Rot","EucMadSol","PinPol","PinMadSol"],"not_rendered":{"charts":0,"images":23,"macros":1,"external_links":0,"defined_names":0,"comments":0,"pivot_tables":0},"unopened":[],"bounds":{"document_bytes":16777216,"sheet_cells":100000,"rows_first":2000,"rows_last":500,"rows_between":2000,"halvings":0,"cell_chars":16384,"cell_head_chars":4096},"cells_cut":0,"cells_raw":0,"read":"whole","date_system":"1900"}

{"sheet":"PRINCIPAL","index":0,"n_rows":22,"n_cols":10,"rows_kept":22,"cut":false,"hidden":false,"merged":[[2,5,2,7],[0,9,0,12],[1,9,1,12]]}
[null,null,null,"Câmbio (R$/US$):",5,null,null,null,null,"Planilha preparada por Luiz C. E. Rodriguez"]
[null,null,null,"Custo Fixo Anual (R$/ha):",200,null,null,null,null,"14/06/2020 - ESALQ/USP"]
[null,null,null,null,null,"Custo de Colheita (R$/m3)"]
[null,null,null,null,"Preço/m3","Alta Tec","Med Tec","Baixa Tec"]
[null,null,null,"Eucalipto p/ energia em pé (R$/m3):",35,0,0,0]
[null,null,null,"Eucalipto p/ polpa (R$/m3):",60,22,23,28]
[null,null,null,"Eucalipto p/ serraria (R$/m3):",200,22,23,28]
[null,null,null,"Pinus p/ polpa (R$/m3):",35,20,22,26]
[null,null,null,"Pinus p/ serraria (R$/m3):",210,20,22,26]
[null,"Painel de opções 1:"]
[]
[]
[]
[]
[]
[]
[]
[]
[]
[]
[]
[null,"Painel de opções 2:"]

{"sheet":"Componentes","index":1,"n_rows":56,"n_cols":11,"rows_kept":56,"cut":false,"hidden":false,"merged":[[0,0,0,6],[2,0,2,5],[3,0,3,5],[21,8,21,9],[1,0,1,5]]}
["Valores básicos dos componentes de custo"]
["Valor da madeira ($):",null,null,null,null,null,35,{"$f":"G2/J6","v":35},"<- valor corrigido pela taxa de câmbio selecionado pelo usuário"]
["Taxa de Câmbio:",null,null,null,null,null,{"$f":"PRINCIPAL!E1","v":5}]
["Custo Fixo Anual de Administração:",null,null,null,null,null,{"$f":"PRINCIPAL!E2","v":200},{"$f":"G4/J6","v":200},"<- valor corrigido pela taxa de câmbio selecionado pelo usuário"]
[null,null,null,null,null,null,null,null,null,"Auxiliar"]
["Mão-de-Obra","Unidade","US$/un","US$/un (*)","US$/h (**)","R$/un.","R$/h",null,null,1,"<- taxa de câmbio depende da moeda selecionada pelo usuário"]
["Encarregado de Corte","mês",500,{"$f":"C7*$B$18","v":950},{"$f":"D7*(12/293)/8","v":4.8634812286689417},{"$f":"D7*$G$3","v":4750},{"$f":"E7*$G$3","v":24.317406143344709},null,null,{"$f":"G7/$J$6","v":24.317406143344709}]
["Mecânico","mês",300,570,{"$f":"D8*(12/293)/8","v":2.9180887372013653},2850,14.590443686006827,null,null,{"$f":"G8/$J$6","v":14.590443686006827}]
["Motorista","mês",450,855,4.3771331058020477,4275,21.88566552901024,null,null,21.88566552901024]
["Operador de Moto-serra","mês",300,570,2.9180887372013653,2850,14.590443686006827,null,null,14.590443686006827]
["Ajudante de Op.de M.S.","mês",180,342,1.750853242320819,1710,8.7542662116040955,null,null,8.7542662116040955]
["Braçal ","dia",12,22.799999999999997,{"$f":"D12/8","v":2.8499999999999996},113.99999999999999,14.249999999999998,null,null,14.249999999999998]
["Tratorista","mês",200,380,1.9453924914675766,1900,9.7269624573378834,null,null,9.7269624573378834]
["Administrador","mês",600,1140,5.8361774744027306,5700,29.180887372013654,null,null,29.180887372013654]
["Apontador","mês",100,190,0.97269624573378832,950,4.8634812286689417,null,null,4.8634812286689417]
["Capataz","mês",150,285,1.4590443686006827,1425,7.2952218430034135,null,null,7.2952218430034135]
["Mensalista","mês",100,190,0.97269624573378832,950,4.8634812286689417,null,null,4.8634812286689417]
["(*) Com encargos sociais e benefícios, i.é salário base vezes",1.9]
["(**) Consideradas 8 h por dia e 293 dias úteis por ano"]
[]
[]
["Máquinas","Unidade","US$/un","US$/un (*)","US$/h (**)","R$/un","R$/un (*)","R$/h (**)","Auxiliar"]
["Pulverizador costal motorizado","h",0.38500000000000001,{"$f":"C23*$B$42","v":0.6160000000000001},{"$f":"C23*$B$43","v":0.71225000000000005},{"$f":"C23*$G$3","v":1.925},{"$f":"D23*$G$3","v":3.0800000000000005},{"$f":"E23*$G$3","v":3.5612500000000002},3.5612500000000002,{"$f":"I23/$J$6","v":3.5612500000000002}]
["Caminhão (140 CV)","h",2.25,3.6,4.1625000000000005,11.25,18,20.812500000000004,20.812500000000004,{"$f":"I24/$J$6","v":20.812500000000004}]
["Caminhão + Carreta 4 ton.","h",3.15,5.04,5.8274999999999997,15.75,25.2,29.137499999999999,29.137499999999999,29.137499999999999]
["Pá carregadeira 930","h",4.25,6.8000000000000007,7.8625000000000007,21.25,34,39.3125,39.3125,39.3125]
["Retroescavadeira","h",4.875,7.8000000000000007,9.0187500000000007,24.375,39,45.09375,45.09375,45.09375]
["Patrol","h",6,9.6000000000000014,11.100000000000001,30,48.000000000000007,55.500000000000007,55.500000000000007,55.500000000000007]
["Motoniveladora Caterpillar","h",6.15,9.8400000000000016,11.377500000000001,30.75,49.20000000000001,56.887500000000003,56.887500000000003,56.887500000000003]
["Triturador Florestal","h",7.1749999999999998,11.48,13.27375,35.875,57.400000000000006,66.368750000000006,66.368750000000006,66.368750000000006]
["Trator Médio + Tanque pulverizador com 2 mangueiras","h",4.75,7.6000000000000005,8.7874999999999996,23.75,38,43.9375,43.9375,43.9375]
["Trator Médio + Pulverizador de barra (tanque 2000 l)","h",5.125,8.2000000000000011,9.4812500000000011,25.625,41.000000000000007,47.406250000000007,47.406250000000007,47.406250000000007]
["MF 290 + Grade 28 discos","h",6.4,10.240000000000002,11.840000000000002,32,51.20000000000001,59.20000000000001,59.20000000000001,59.20000000000001]
["MF 290 + Roçadeira","h",6.75,10.8,12.487500000000001,33.75,54,62.4375,62.4375,62.4375]
["MF 290 + Rolo CA-25","h",7.375,11.8,13.643750000000001,36.875,59,68.21875,68.21875,68.21875]
["MF 290 + Aplicador calcário","h",7.5,12,13.875,37.5,60,69.375,69.375,69.375]
["MF 290 + Aplicador Adubo Granulado","h",7.75,12.4,14.3375,38.75,62,71.6875,71.6875,71.6875]
["MF 290 + Conjunto Irrigação Motobomba","h",7.4,11.840000000000002,13.690000000000001,37,59.20000000000001,68.45,68.45,68.45]
["D6 + Lâmina","h",5.6,8.9599999999999991,10.36,28,44.8,51.8,51.8,51.8]
["D6 + Subsolador","h",6.1749999999999998,9.8800000000000008,11.42375,30.875,49.400000000000006,57.118749999999999,57.118749999999999,57.118749999999999]
["D6 + Rebaixador","h",6.95,11.120000000000001,12.857500000000002,34.75,55.600000000000009,64.287500000000009,64.287500000000009,64.287500000000009]
["(*) Custos com depreciação, i.é custo base vezes",1.6]
["(**) Aluguel no mercado de serviços, ié base vezes",1.85]
[]
["Insumos","Unidade","US$/un","R$/un","Auxiliar"]
["Mudas","milhar",70,{"$f":"C46*$G$3","v":350},{"$f":"D46/$J$6","v":350}]
["Calcário dolomítico","ton",17,85,{"$f":"D47/$J$6","v":85}]
["Sulfato de Amônia","ton",234.39,1171.9499999999998,1171.9499999999998]
["Uréia","ton",337.69,1688.45,1688.45]
["Superfosfato Simples","ton",164.78,823.9,823.9]
["Cloreto de potássio","ton",293.14,1465.6999999999998,1465.6999999999998]
["NPK-6:30:6","ton",200,1000,1000]
["NPK-8:5:18","ton",200,1000,1000]
["NPK-10:00:10","ton",200,1000,1000]
["Fomicida Granulado (isca)","kg",8.82,44.1,44.1]
["Round up","l",13.57,67.849999999999994,67.849999999999994]

{"sheet":"Tecno","index":2,"n_rows":403,"n_cols":8,"rows_kept":403,"cut":false,"hidden":false,"merged":[[399,0,400,0],[44,0,45,0],[50,0,51,0],[57,0,58,0],[64,0,65,0],[70,0,71,0],[76,0,77,0],[83,0,84,0],[379,0,380,0],[90,0,91,0],[96,0,97,0],[347,0,348,0],[353,0,354,0],[360,0,361,0],[273,0,274,0],[279,0,280,0],[286,0,287,0],[386,0,387,0],[393,0,394,0],[367,0,368,0],[373,0,374,0],[341,0,342,0],[293,0,294,0],[299,0,300,0],[310,0,311,0],[308,0,308,7],[327,0,328,0],[335,0,336,0],[253,0,254,0],[260,0,261,0],[267,0,268,0],[235,0,236,0],[241,0,242,0],[247,0,248,0],[210,0,211,0],[227,0,228,0],[208,0,208,7],[186,0,187,0],[193,0,194,0],[199,0,200,0],[167,0,168,0],[173,0,174,0],[179,0,180,0],[147,0,148,0],[153,0,154,0],[160,0,161,0],[135,0,136,0],[108,0,108,7],[141,0,142,0],[5,0,5,7],[110,0,111,0],[127,0,128,0],[7,0,8,0],[24,0,25,0],[32,0,33,0],[38,0,39,0]]}
["Observação:","para modificar os rendimentos, altere as tabelas digitadas a partir das linhas"]
[null,"110 (Alta tecnologia), 210 (Média Tecnologia) e 310 (Baixa Tecnologia)."]
[]
[]
[]
["Definição de Rendimentos Operacionais (varia conforme a tecnologia/escala)"]
["PRIMEIRA ROTAÇÃO"]
["Plantio"]
[null,"Braçal","Tratorista",null,"Produto","Quantidade",null,"Equipamento"]
["Conservação do Solo"]
["Construção de Aceiros"]
["Calagem",1.2,1.2,null,"Calcário dolomítico",4,null,"MF 290 + Aplicador calcário"]
["Combate a formiga 1",2.3199999999999998,null,null,"Formicida granulado",1.5]
["Combate a formiga 2"]
["Combate a formiga 3"]
["Controle Químico Mec. Total"]
["Subsolagem"]
["Coveamento",16]
["Adubação",1.2,1.2,null,"NPK-6:30:6",200,null,"MF 290 + Aplicador Adubo Granulado"]
["Plantio",12,3,null,"Mudas",1667,null,"Valmet 880 + carreta"]
["Irrigação"]
["Levantamento Sobrevivência"]
["Replantio"]
["Adubação cobertura"]
["Primeira Manutenção"]
[]
["Conservação do Solo"]
["Controle Químico Linha ",6,null,null,"Round up",0.94,null,"Pulverizador costal motorizado"]
["Controle Químico Entrelinha"]
["Controle de formigas",1.8,null,null,"Formicida granulado",0.7,null,"Caminhão + Carreta 4 ton."]
["Adubação de reforço manual",11.63,0.94,null,"NPK-6:30:6",200]
["Manutenção de Aceiros"]
["Segunda Manutenção"]
[]
["Controle Químico Entrelinha"]
["Fosfatagem"]
["Roçada Manual Linha",8]
["Patrolamento Aceiro"]
["Terceira Manutenção"]
[]
["Controle Químico Entrelinha"]
["Adubação de Manutenção"]
["Controle formiga manutenção",1.4,null,null,"Formicida granulado",0.6]
["Patrolamento Aceiro"]
["Demais Manutenções"]
[]
["Controle formiga manutenção",1.4,null,null,"Formicida granulado",0.6]
["Patrolamento Aceiro"]
[]
["SEGUNDA ROTAÇÃO"]
["Primeira Manutenção"]
[null,"Braçal","Tratorista",null,"Produto","Quantidade",null,"Equipamento"]
["Controle Químico Linha ",6,null,null,"Round up",0.94]
["Controle Químico Entrelinha"]
["Controle de formigas",1.8,null,null,"Formicida granulado",0.7]
["Adubação de Manutenção",0.1,0.42,null,"NPK-8:5:18 líquido",200,null,"Trator Médio + Tanque pulverizador com 2 mangueiras"]
["Patrolamento Aceiro"]
["Segunda Manutenção"]
[]
["Controle Químico Entrelinha"]
["Fosfatagem",0.66,1.02,null,"Superfosfato Simples",300,null,"MF 290 + Aplicador Adubo Granulado"]
["Desbrota",12,null,null,null,null,null,"Motoroçadeira"]
["Roçada Manual Linha",4]
["Patrolamento Aceiro"]
["Terceira Manutenção"]
[]
["Controle Químico Entrelinha"]
["Adubação de Manutenção"]
["Controle formiga manutenção",1.4,null,null,"Formicida granulado",0.6]
["Patrolamento Aceiro"]
["Demais Manutenções"]
[]
["Controle formiga manutenção",1.4,null,null,"Formicida granulado",0.6]
["Patrolamento Aceiro"]
[]
["TERCEIRA ROTAÇÃO"]
["Primeira Manutenção"]
[null,"Braçal","Tratorista",null,"Produto","Quantidade",null,"Equipamento"]
["Controle Químico Linha ",6,null,null,"Round up",0.94]
["Controle Químico Entrelinha"]
["Controle de formigas",1.8,null,null,"Formicida granulado",0.7]
["Adubação de Manutenção",0.1,0.42,null,"NPK-8:5:18 líquido",200,null,"Trator Médio + Tanque pulverizador com 2 mangueiras"]
["Patrolamento Aceiro"]
["Segunda Manutenção"]
[]
["Controle Químico Entrelinha"]
["Fosfatagem",0.66,1.02,null,"Superfosfato Simples",300,null,"MF 290 + Aplicador Adubo Granulado"]
["Desbrota",12,null,null,null,null,null,"Motoroçadeira"]
["Roçada Manual Linha",4]
["Patrolamento Aceiro"]
["Terceira Manutenção"]
[]
["Controle Químico Entrelinha"]
["Adubação de Manutenção"]
["Controle formiga manutenção",1.4,null,null,"Formicida granulado",0.6]
["Patrolamento Aceiro"]
["Demais Manutenções"]
[]
["Controle formiga manutenção",1.4,null,null,"Formicida granulado",0.6]
["Patrolamento Aceiro"]
[]
[]
[]
[]
[]
[]
[]
[]
["Alta Tecnologia / Grande Escala"]
["PRIMEIRA ROTAÇÃO"]
["Plantio"]
[null,"Braçal","Tratorista",null,"Produto","Quantidade",null,"Equipamento"]
["Conservação do Solo",1.2,1.2,null,null,null,null,"Motoniveladora Caterpillar"]
["Construção de Aceiros",6.4,6.4,null,null,null,null,"Motoniveladora Caterpillar"]
["Calagem",1.2,1.2,null,"Calcário dolomítico",4,null,"MF 290 + Aplicador calcário"]
["Combate a formiga 1",2.3199999999999998,null,null,"Formicida granulado",1.5]
["Combate a formiga 2",2.81,null,null,"Formicida granulado",0.75]
["Combate a formiga 3",2.81,null,null,"Formicida granulado",0.5]
["Controle Químico Mec. Total",1.04,1.04,null,"Round up",5.01,null,"Trator Médio + Tanque pulverizador com 2 mangueiras"]
["Subsolagem",1.06,1.23,null,null,null,null,"D6 + Subsolador"]
["Coveamento",8.36]
["Adubação",1.2,1.2,null,"NPK-6:30:6",250,null,"MF 290 + Aplicador Adubo Granulado"]
["Plantio",8.44,0.55000000000000004,null,"Mudas",1667,null,"Valmet 880 + carreta"]
["Irrigação",0.5,0.12,null,null,null,null,"Trator Médio + Tanque pulverizador com 2 mangueiras"]
["Levantamento Sobrevivência",0.42]
["Replantio",2.62,0.13,null,null,null,null,"Valmet 880 + carreta"]
["Adubação cobertura",0.02,0.62,null,"NPK-10:00:10",375,null,"MF 290 + Aplicador Adubo Granulado"]
["Primeira Manutenção"]
[]
["Conservação do Solo",1.2,1.2,null,null,null,null,"Motoniveladora Caterpillar"]
["Controle Químico Linha ",4.6500000000000004,null,null,"Round up",0.94,null,"Pulverizador costal motorizado"]
["Controle Químico Entrelinha",null,1.3,null,"Round up",2.97,null,"Trator Médio + Tanque pulverizador com 2 mangueiras"]
["Controle de formigas",1.8,null,null,"Formicida granulado",0.7,null,"Caminhão + Carreta 4 ton."]
["Adubação de reforço manual",11.63,0.94,null,"NPK-6:30:6",200]
["Manutenção de Aceiros",2.13,0.05,null,null,null,null,"Motoniveladora Caterpillar"]
["Segunda Manutenção"]
[]
["Controle Químico Entrelinha",null,1.3,null,"Round up",2.97,null,"Trator Médio + Tanque pulverizador com 2 mangueiras"]
["Fosfatagem",0.66,1.02,null,"Superfosfato Simples",300,null,"MF 290 + Aplicador Adubo Granulado"]
["Roçada Manual Linha",5.27]
["Patrolamento Aceiro",null,1.3,null,null,null,null,"Patrol"]
["Terceira Manutenção"]
[]
["Controle Químico Entrelinha",null,1.3,null,"Round up",2.97,null,"Trator Médio + Tanque pulverizador com 2 mangueiras"]
["Adubação de Manutenção",0.01,0.42,null,"NPK-8:5:18 líquido",300,null,"Trator Médio + Tanque pulverizador com 2 mangueiras"]
["Controle formiga manutenção",1.4,null,null,"Formicida granulado",0.6]
["Patrolamento Aceiro",null,1.3,null,null,null,null,"Patrol"]
["Demais Manutenções"]
[]
["Controle formiga manutenção",1.4,null,null,"Formicida granulado",0.6]
["Patrolamento Aceiro",null,1.3,null,null,null,null,"Patrol"]
[]
["SEGUNDA ROTAÇÃO"]
["Primeira Manutenção"]
[null,"Braçal","Tratorista",null,"Produto","Quantidade",null,"Equipamento"]
["Controle Químico Linha ",4.6500000000000004,null,null,"Round up",0.94]
["Controle Químico Entrelinha",null,1.3,null,"Round up",2.97,null,"Trator Médio + Tanque pulverizador com 2 mangueiras"]
["Controle de formigas",1.8,null,null,"Formicida granulado",0.7]
["Adubação de Manutenção",0.01,0.42,null,"NPK-8:5:18 líquido",300,null,"Trator Médio + Tanque pulverizador com 2 mangueiras"]
["Patrolamento Aceiro",null,1.3,null,null,null,null,"Patrol"]
["Segunda Manutenção"]
[]
["Controle Químico Entrelinha",null,1.3,null,"Round up",2.97,null,"Trator Médio + Tanque pulverizador com 2 mangueiras"]
["Fosfatagem",0.66,1.02,null,"Superfosfato Simples",300,null,"MF 290 + Aplicador Adubo Granulado"]
["Desbrota",14.6,null,null,null,null,null,"Motoroçadeira"]
["Roçada Manual Linha",5.27]
["Patrolamento Aceiro",null,1.3,null,null,null,null,"Patrol"]
["Terceira Manutenção"]
[]
["Controle Químico Entrelinha",null,1.3,null,"Round up",2.97,null,"Trator Médio + Tanque pulverizador com 2 mangueiras"]
["Adubação de Manutenção",0.01,0.42,null,"NPK-8:5:18 líquido",300,null,"Trator Médio + Tanque pulverizador com 2 mangueiras"]
["Controle formiga manutenção",1.4,null,null,"Formicida granulado",0.6]
["Patrolamento Aceiro",null,1.3,null,null,null,null,"Patrol"]
["Demais Manutenções"]
[]
["Controle formiga manutenção",1.4,null,null,"Formicida granulado",0.6]
["Patrolamento Aceiro",null,1.3,null,null,null,null,"Patrol"]
[]
["TERCEIRA ROTAÇÃO"]
["Primeira Manutenção"]
[null,"Braçal","Tratorista",null,"Produto","Quantidade",null,"Equipamento"]
["Controle Químico Linha ",4.6500000000000004,null,null,"Round up",0.94]
["Controle Químico Entrelinha",null,1.3,null,"Round up",2.97,null,"Trator Médio + Tanque pulverizador com 2 mangueiras"]
["Controle de formigas",1.8,null,null,"Formicida granulado",0.7]
["Adubação de Manutenção",0.01,0.42,null,"NPK-8:5:18 líquido",300,null,"Trator Médio + Tanque pulverizador com 2 mangueiras"]
["Patrolamento Aceiro",null,1.3,null,null,null,null,"Patrol"]
["Segunda Manutenção"]
[]
["Controle Químico Entrelinha",null,1.3,null,"Round up",2.97,null,"Trator Médio + Tanque pulverizador com 2 mangueiras"]
["Fosfatagem",0.66,1.02,null,"Superfosfato Simples",300,null,"MF 290 + Aplicador Adubo Granulado"]
["Desbrota",14.6,null,null,null,null,null,"Motoroçadeira"]
["Roçada Manual Linha",5.27]
["Patrolamento Aceiro",null,1.3,null,null,null,null,"Patrol"]
["Terceira Manutenção"]
[]
["Controle Químico Entrelinha",null,1.3,null,"Round up",2.97,null,"Trator Médio + Tanque pulverizador com 2 mangueiras"]
["Adubação de Manutenção",0.01,0.42,null,"NPK-8:5:18 líquido",300,null,"Trator Médio + Tanque pulverizador com 2 mangueiras"]
["Controle formiga manutenção",1.4,null,null,"Formicida granulado",0.6]
["Patrolamento Aceiro",null,1.3,null,null,null,null,"Patrol"]
["Demais Manutenções"]
[]
["Controle formiga manutenção",1.4,null,null,"Formicida granulado",0.6]
["Patrolamento Aceiro",null,1.3,null,null,null,null,"Patrol"]
[]
[]
[]
[]
[]
["Média Tecnologia / Média Escala"]
["PRIMEIRA ROTAÇÃO"]
["Plantio"]
[null,"Braçal","Tratorista",null,"Produto","Quantidade",null,"Equipamento"]
["Conservação do Solo"]
["Construção de Aceiros",5,5,null,null,null,null,"Motoniveladora Caterpillar"]
["Calagem",1.2,1.2,null,"Calcário dolomítico",4,null,"MF 290 + Aplicador calcário"]
["Combate a formiga 1",2.3199999999999998,null,null,"Formicida granulado",1.5]
["Combate a formiga 2",2.81,null,null,"Formicida granulado",0.75]
["Combate a formiga 3"]
["Controle Químico Mec. Total",1.04,1.04,null,"Round up",5.01,null,"Trator Médio + Tanque pulverizador com 2 mangueiras"]
["Subsolagem"]
["Coveamento",8.36]
["Adubação",1.2,1.2,null,"NPK-6:30:6",200,null,"MF 290 + Aplicador Adubo Granulado"]
["Plantio",8.44,0.55000000000000004,null,"Mudas",1667,null,"Valmet 880 + carreta"]
["Irrigação"]
["Levantamento Sobrevivência"]
["Replantio"]
["Adubação cobertura",0.02,0.62,null,"NPK-10:00:10",300,null,"MF 290 + Aplicador Adubo Granulado"]
["Primeira Manutenção"]
[]
["Conservação do Solo"]
["Controle Químico Linha ",4.6500000000000004,null,null,"Round up",0.94,null,"Pulverizador costal motorizado"]
["Controle Químico Entrelinha"]
["Controle de formigas",1.8,null,null,"Formicida granulado",0.7,null,"Caminhão + Carreta 4 ton."]
["Adubação de reforço manual",11.63,0.94,null,"NPK-6:30:6",200]
["Manutenção de Aceiros",1.05,0.05,null,null,null,null,"Motoniveladora Caterpillar"]
["Segunda Manutenção"]
[]
["Controle Químico Entrelinha"]
["Fosfatagem",0.66,1.02,null,"Superfosfato Simples",250,null,"MF 290 + Aplicador Adubo Granulado"]
["Roçada Manual Linha",5.27]
["Patrolamento Aceiro",null,0.7,null,null,null,null,"Patrol"]
["Terceira Manutenção"]
[]
["Controle Químico Entrelinha"]
["Adubação de Manutenção",0.01,0.42,null,"NPK-8:5:18 líquido",250,null,"Trator Médio + Tanque pulverizador com 2 mangueiras"]
["Controle formiga manutenção",1.4,null,null,"Formicida granulado",0.6]
["Patrolamento Aceiro",null,0.7,null,null,null,null,"Patrol"]
["Demais Manutenções"]
[]
["Controle formiga manutenção",1.4,null,null,"Formicida granulado",0.6]
["Patrolamento Aceiro",null,0.7,null,null,null,null,"Patrol"]
[]
["SEGUNDA ROTAÇÃO"]
["Primeira Manutenção"]
[null,"Braçal","Tratorista",null,"Produto","Quantidade",null,"Equipamento"]
["Controle Químico Linha ",4.6500000000000004,null,null,"Round up",0.94]
["Controle Químico Entrelinha"]
["Controle de formigas",1.8,null,null,"Formicida granulado",0.7]
["Adubação de Manutenção",0.01,0.42,null,"NPK-8:5:18 líquido",250,null,"Trator Médio + Tanque pulverizador com 2 mangueiras"]
["Patrolamento Aceiro",null,0.7,null,null,null,null,"Patrol"]
["Segunda Manutenção"]
[]
["Controle Químico Entrelinha",null,1.3,null,"Round up",2.97,null,"Trator Médio + Tanque pulverizador com 2 mangueiras"]
["Fosfatagem",0.66,1.02,null,"Superfosfato Simples",250,null,"MF 290 + Aplicador Adubo Granulado"]
["Desbrota",14.6,null,null,null,null,null,"Motoroçadeira"]
["Roçada Manual Linha",5.27]
["Patrolamento Aceiro",null,0.7,null,null,null,null,"Patrol"]
["Terceira Manutenção"]
[]
["Controle Químico Entrelinha",null,1.3,null,"Round up",2.97,null,"Trator Médio + Tanque pulverizador com 2 mangueiras"]
["Adubação de Manutenção",0.01,0.42,null,"NPK-8:5:18 líquido",250,null,"Trator Médio + Tanque pulverizador com 2 mangueiras"]
["Controle formiga manutenção",1.4,null,null,"Formicida granulado",0.6]
["Patrolamento Aceiro",null,0.7,null,null,null,null,"Patrol"]
["Demais Manutenções"]
[]
["Controle formiga manutenção",1.4,null,null,"Formicida granulado",0.6]
["Patrolamento Aceiro",null,0.7,null,null,null,null,"Patrol"]
[]
["TERCEIRA ROTAÇÃO"]
["Primeira Manutenção"]
[null,"Braçal","Tratorista",null,"Produto","Quantidade",null,"Equipamento"]
["Controle Químico Linha ",4.6500000000000004,null,null,"Round up",0.94]
["Controle Químico Entrelinha"]
["Controle de formigas",1.8,null,null,"Formicida granulado",0.7]
["Adubação de Manutenção",0.01,0.42,null,"NPK-8:5:18 líquido",250,null,"Trator Médio + Tanque pulverizador com 2 mangueiras"]
["Patrolamento Aceiro",null,0.7,null,null,null,null,"Patrol"]
["Segunda Manutenção"]
[]
["Controle Químico Entrelinha",null,1.3,null,"Round up",2.97,null,"Trator Médio + Tanque pulverizador com 2 mangueiras"]
["Fosfatagem",0.66,1.02,null,"Superfosfato Simples",250,null,"MF 290 + Aplicador Adubo Granulado"]
["Desbrota",14.6,null,null,null,null,null,"Motoroçadeira"]
["Roçada Manual Linha",5.27]
["Patrolamento Aceiro",null,0.7,null,null,null,null,"Patrol"]
["Terceira Manutenção"]
[]
["Controle Químico Entrelinha",null,1.3,null,"Round up",2.97,null,"Trator Médio + Tanque pulverizador com 2 mangueiras"]
["Adubação de Manutenção",0.01,0.42,null,"NPK-8:5:18 líquido",250,null,"Trator Médio + Tanque pulverizador com 2 mangueiras"]
["Controle formiga manutenção",1.4,null,null,"Formicida granulado",0.6]
["Patrolamento Aceiro",null,0.7,null,null,null,null,"Patrol"]
["Demais Manutenções"]
[]
["Controle formiga manutenção",1.4,null,null,"Formicida granulado",0.6]
["Patrolamento Aceiro",null,0.7,null,null,null,null,"Patrol"]
[]
[]
[]
[]
[]
["Baixa Tecnologia / Pequena Escala"]
["PRIMEIRA ROTAÇÃO"]
["Plantio"]
[null,"Braçal","Tratorista",null,"Produto","Quantidade",null,"Equipamento"]
["Conservação do Solo"]
["Construção de Aceiros"]
["Calagem",1.2,1.2,null,"Calcário dolomítico",4,null,"MF 290 + Aplicador calcário"]
["Combate a formiga 1",2.3199999999999998,null,null,"Formicida granulado",1.5]
["Combate a formiga 2"]
["Combate a formiga 3"]
["Controle Químico Mec. Total"]
["Subsolagem"]
["Coveamento",16]
["Adubação",1.2,1.2,null,"NPK-6:30:6",200,null,"MF 290 + Aplicador Adubo Granulado"]
["Plantio",12,3,null,"Mudas",1667,null,"Valmet 880 + carreta"]
["Irrigação"]
["Levantamento Sobrevivência"]
["Replantio"]
["Adubação cobertura"]
["Primeira Manutenção"]
[]
["Conservação do Solo"]
["Controle Químico Linha ",6,null,null,"Round up",0.94,null,"Pulverizador costal motorizado"]
["Controle Químico Entrelinha"]
["Controle de formigas",1.8,null,null,"Formicida granulado",0.7,null,"Caminhão + Carreta 4 ton."]
["Adubação de reforço manual",11.63,0.94,null,"NPK-6:30:6",200]
["Manutenção de Aceiros"]
["Segunda Manutenção"]
[]
["Controle Químico Entrelinha"]
["Fosfatagem"]
["Roçada Manual Linha",8]
["Patrolamento Aceiro"]
["Terceira Manutenção"]
[]
["Controle Químico Entrelinha"]
["Adubação de Manutenção"]
["Controle formiga manutenção",1.4,null,null,"Formicida granulado",0.6]
["Patrolamento Aceiro"]
["Demais Manutenções"]
[]
["Controle formiga manutenção",1.4,null,null,"Formicida granulado",0.6]
["Patrolamento Aceiro"]
[]
["SEGUNDA ROTAÇÃO"]
["Primeira Manutenção"]
[null,"Braçal","Tratorista",null,"Produto","Quantidade",null,"Equipamento"]
["Controle Químico Linha ",6,null,null,"Round up",0.94]
["Controle Químico Entrelinha"]
["Controle de formigas",1.8,null,null,"Formicida granulado",0.7]
["Adubação de Manutenção",0.1,0.42,null,"NPK-8:5:18 líquido",200,null,"Trator Médio + Tanque pulverizador com 2 mangueiras"]
["Patrolamento Aceiro"]
["Segunda Manutenção"]
[]
["Controle Químico Entrelinha"]
["Fosfatagem",0.66,1.02,null,"Superfosfato Simples",300,null,"MF 290 + Aplicador Adubo Granulado"]
["Desbrota",12,null,null,null,null,null,"Motoroçadeira"]
["Roçada Manual Linha",4]
["Patrolamento Aceiro"]
["Terceira Manutenção"]
[]
["Controle Químico Entrelinha"]
["Adubação de Manutenção"]
["Controle formiga manutenção",1.4,null,null,"Formicida granulado",0.6]
["Patrolamento Aceiro"]
["Demais Manutenções"]
[]
["Controle formiga manutenção",1.4,null,null,"Formicida granulado",0.6]
["Patrolamento Aceiro"]
[]
["TERCEIRA ROTAÇÃO"]
["Primeira Manutenção"]
[null,"Braçal","Tratorista",null,"Produto","Quantidade",null,"Equipamento"]
["Controle Químico Linha ",6,null,null,"Round up",0.94]
["Controle Químico Entrelinha"]
["Controle de formigas",1.8,null,null,"Formicida granulado",0.7]
["Adubação de Manutenção",0.1,0.42,null,"NPK-8:5:18 líquido",200,null,"Trator Médio + Tanque pulverizador com 2 mangueiras"]
["Patrolamento Aceiro"]
["Segunda Manutenção"]
[]
["Controle Químico Entrelinha"]
["Fosfatagem",0.66,1.02,null,"Superfosfato Simples",300,null,"MF 290 + Aplicador Adubo Granulado"]
["Desbrota",12,null,null,null,null,null,"Motoroçadeira"]
["Roçada Manual Linha",4]
["Patrolamento Aceiro"]
["Terceira Manutenção"]
[]
["Controle Químico Entrelinha"]
["Adubação de Manutenção"]
["Controle formiga manutenção",1.4,null,null,"Formicida granulado",0.6]
["Patrolamento Aceiro"]
["Demais Manutenções"]
[]
["Controle formiga manutenção",1.4,null,null,"Formicida granulado",0.6]
["Patrolamento Aceiro"]

{"sheet":"TabProd","index":3,"n_rows":49,"n_cols":12,"rows_kept":49,"cut":false,"hidden":false,"merged":[[0,0,0,11],[15,1,15,2],[2,1,2,3],[2,5,2,7],[15,5,15,6],[39,7,39,8],[21,3,21,5],[21,6,21,8],[32,0,32,11],[21,9,21,11],[26,1,26,3],[26,5,26,7],[44,1,44,2],[44,4,44,5],[33,0,33,3],[39,3,39,4],[39,5,39,6]]}
["Eucalyptus"]
[null,null,"Polpa",null,null,null,"Energia"]
["1a. Rotação","coficientes do modelo",null,null,null,"coeficientes do modelo"]
[null,"Alta","Média","Baixa",null,"Alta","Média","Baixa"]
["b=",10.85,9.3000000000000007,9,null,12.6,null,16]
["a=",0.24,0.26,0.23,null,0.24,null,0.18]
["q=",2.81,2.87,2.92,null,2.5,null,2.2000000000000002]
["2a. Rotação"]
["b=",13.95,12.1,10.6,null,14.5,null,15.13]
["a=",0.26,0.27,0.26,null,0.23,null,0.2]
["q=",2.46,2.5,2.57,null,2.3199999999999998,null,2.16]
["Age",null,null,null,"Age",null,"Interpolation"]
[7,{"$f":"((B5*(1-EXP(-B6*A13)))^B7)*0.7","v":318.382640146536},{"$f":"((C5*(1-EXP(-C6*A13)))^C7)*0.7","v":253.69746857463767},{"$f":"(($D$5*(1-EXP(-$D$6*A13)))^$D$7)*0.7","v":223.19633985205681},7,{"$f":"((F5*(1-EXP(-F6*E13)))^F7)*0.7","v":235.55182890549492},{"$f":"H13+(F13-H13)/2","v":192.66218787204932},{"$f":"((H5*(1-EXP(-H6*E13)))^H7)*0.7","v":149.77254683860372}]
[7,{"$f":"((B9*(1-EXP(-B10*A14)))^B11)*0.7","v":296.41354557369328},{"$f":"((C9*(1-EXP(-C10*A14)))^C11)*0.7","v":236.72212756137861},{"$f":"((D9*(1-EXP(-D10*A14)))^D11)*0.7","v":191.79485079513313},7,{"$f":"((F9*(1-EXP(-F10*E14)))^F11)*0.7","v":206.43441931945077},{"$f":"H14+(F14-H14)/2","v":170.34451895030043},{"$f":"((H9*(1-EXP(-H10*E14)))^H11)*0.7","v":134.25461858115005}]
[null,null,null,null,7,{"$f":"F14*(1-(F13-F14)/F13)","v":180.91631755852907},{"$f":"G14*(1-(G13-G14)/G13)","v":150.61209185312575},{"$f":"H14*(1-(H13-H14)/H13)","v":120.34450231919497},"<- mesmo % da 1a para a 2a rotação"]
[null,"Dependente da Tecnol.",null,null,null,"Dependente da Tecnol."]
[null,"Volume","Custo",null,null,"Volume","Custo"]
[null,223.19633985205681,28,null,null,149.77254683860372,0]
[null,191.79485079513313,28,null,null,134.25461858115005,0]
[null,null,null,null,null,120.34450231919497,0]
["Serraria"]
["Plantio:",833,null,"Baixa",null,null,"Média",null,null,"Alta"]
["Desbastes","Idade","Árv. Rem.","Vol Energia","Vol Polpa","Vol Sólido","Vol Energia","Vol Polpa","Vol Sólido","Vol Energia","Vol Polpa","Vol Sólido"]
[1,4,500,{"$f":"J24*0.7","v":48.504727776512389},{"$f":"K24*0.7","v":0},0,{"$f":"J24*0.8","v":55.433974601728451},0,0,{"$f":"(($D$5*(1-EXP(-$D$6*$B24)))^$D$7)*0.5","v":69.29246825216056},0,0]
[2,8,275,{"$f":"J25*0.7","v":0},129.16229469055821,0,0,147.61405107492371,0,0,{"$f":"(($D$5*(1-EXP(-$D$6*$B25)))^$D$7)*0.5","v":184.51756384365461},0]
["Corte Raso",15,0,{"$f":"J26*0.7","v":0},116.86828041793325,272.6926543085109,0,133.56374904906659,311.64874778115541,0,{"$f":"((($D$5*(1-EXP(-$D$6*$B26)))^$D$7)*0.5)*3/5","v":166.95468631133323},{"$f":"(($D$5*(1-EXP(-$D$6*$B26)))^$D$7)*0.7","v":389.5609347264442}]
[null,"Volumes dependentes da Tecnol.",null,null,null,"Custos dependentes da Tecnol."]
[null," Energia","Polpa","Sólido",null,"Energia","Polpa","Sólido"]
[null,48.504727776512389,0,0,null,0,0,0]
[null,0,129.16229469055821,0,null,0,28,0]
[null,0,116.86828041793325,272.6926543085109,null,0,28,28]
[]
["Pinus"]
["Vol Polpa",null,null,null,null,"Vol. dependente",null,"Custo dependente"]
["Age","Alta","Média","Baixa",null,"da Tecnol.",null,"da Tecnol."]
[12,364,{"$f":"B36*0.8","v":291.2},{"$f":"B36*0.7","v":254.79999999999998},null,254.79999999999998,null,26]
[]
[]
["Serraria"]
["Plantio:",1111,null,"Baixa",null,"Média",null,"Alta"]
["Desbastes","Idade","Árv. Rem.","Vol Polpa","Vol Sólido","Vol Polpa","Vol Sólido","Vol Polpa","Vol Sólido"]
[1,8,550,{"$f":"H42*0.7","v":27.09},0,{"$f":"H42*0.8","v":30.960000000000004},0,38.700000000000003,0]
[2,12,250,15.749999999999998,42,18,48,22.5,60]
["Corte Raso",18,0,11.899999999999999,182,13.600000000000001,208,17,260]
[null,"Dependente da Tecnol.",null,null,"Dependente da Tecnol."]
[null,"Polpa","Sólido",null,"Polpa","Sólido"]
[null,27.09,0,null,26,0]
[null,15.749999999999998,42,null,26,26]
[null,11.899999999999999,182,null,26,26]

{"sheet":"EucPol1Rot","index":4,"n_rows":49,"n_cols":10,"rows_kept":49,"cut":false,"hidden":false,"merged":[[7,0,8,0],[7,1,7,3],[7,4,7,6],[7,7,7,8],[24,0,25,0],[24,1,24,3],[24,4,24,6],[0,0,0,6],[1,0,1,6],[2,0,2,6],[3,0,3,6],[4,0,4,6],[44,0,45,0],[44,1,44,3],[44,4,44,6],[44,7,44,8],[24,7,24,8],[38,0,39,0],[38,1,38,3],[38,4,38,6],[38,7,38,8],[32,0,33,0],[32,1,32,3],[32,4,32,6],[32,7,32,8]]}
["Detalhamento dos Custos das Operações - Eucalipto p/ Polpa - Ciclos c/ 1 Rotação"]
["(Rendimento técnico da MDO em homem-hora/hectare)"]
["(Para MDO, considerou-se apenas MDO tipo braçal e tratorista)"]
["(Rendimento técnico do equipamento em hora-máquina/hectare)"]
["(Custo total da operação em $/hectare)"]
[]
["PRIMEIRA ROTAÇÃO",null,null,"Volume aos 7 anos (m3):",253.69746857463767]
["Plantio","Mão-de-Obra",null,null,"Insumo",null,null,"Máquinas"]
[null,"Braçal","Tratorista","Custo","Produto","Quantidade","Custo","Equipamento","Custo","Custo Total"]
["Conservação do Solo",{"$f":"Tecno!B10","v":0},{"$f":"Tecno!C10","v":0},{"$f":"B10*Componentes!$J$12+C10*Componentes!$J$13","v":0},{"$f":"IF(Tecno!E10<>\"\",Tecno!E10,\"\")","v":""},{"$f":"Tecno!F10","v":0},null,{"$f":"IF(Tecno!H10<>\"\",Tecno!H10,\"\")","v":""},{"$f":"Componentes!J29*C10","v":0},{"$f":"D10+G10+I10","v":0}]
["Construção de Aceiros",{"$f":"Tecno!B11","v":0},{"$f":"Tecno!C11","v":0},{"$f":"B11*Componentes!$J$12+C11*Componentes!$J$13","v":0},{"$f":"IF(Tecno!E11<>\"\",Tecno!E11,\"\")","v":""},{"$f":"Tecno!F11","v":0},null,{"$f":"IF(Tecno!H11<>\"\",Tecno!H11,\"\")","v":""},{"$f":"Componentes!J29*C11","v":0},{"$f":"D11+G11+I11","v":0}]
["Calagem",{"$f":"Tecno!B12","v":1.2},{"$f":"Tecno!C12","v":1.2},{"$f":"B12*Componentes!$J$12+C12*Componentes!$J$13","v":28.772354948805457},{"$f":"IF(Tecno!E12<>\"\",Tecno!E12,\"\")","v":"Calcário dolomítico"},{"$f":"Tecno!F12","v":4},{"$f":"F12*Componentes!E47","v":340},{"$f":"IF(Tecno!H12<>\"\",Tecno!H12,\"\")","v":"MF 290 + Aplicador calcário"},{"$f":"Componentes!J36*C12","v":83.25},{"$f":"D12+G12+I12","v":452.02235494880546}]
["Combate a formiga 1",{"$f":"Tecno!B13","v":2.3199999999999998},{"$f":"Tecno!C13","v":0},{"$f":"B13*Componentes!$J$12+C13*Componentes!$J$13","v":33.059999999999995},{"$f":"IF(Tecno!E13<>\"\",Tecno!E13,\"\")","v":"Formicida granulado"},{"$f":"Tecno!F13","v":1.5},{"$f":"F13*Componentes!$E$55","v":66.150000000000006},{"$f":"IF(Tecno!H13<>\"\",Tecno!H13,\"\")","v":""},null,99.210000000000008]
["Combate a formiga 2",{"$f":"Tecno!B14","v":0},{"$f":"Tecno!C14","v":0},{"$f":"B14*Componentes!$J$12+C14*Componentes!$J$13","v":0},{"$f":"IF(Tecno!E14<>\"\",Tecno!E14,\"\")","v":""},{"$f":"Tecno!F14","v":0},{"$f":"F14*Componentes!$E$55","v":0},{"$f":"IF(Tecno!H14<>\"\",Tecno!H14,\"\")","v":""},null,0]
["Combate a formiga 3",{"$f":"Tecno!B15","v":0},{"$f":"Tecno!C15","v":0},{"$f":"B15*Componentes!$J$12+C15*Componentes!$J$13","v":0},{"$f":"IF(Tecno!E15<>\"\",Tecno!E15,\"\")","v":""},{"$f":"Tecno!F15","v":0},{"$f":"F15*Componentes!$E$55","v":0},{"$f":"IF(Tecno!H15<>\"\",Tecno!H15,\"\")","v":""},null,0]
["Controle Químico Mec. Total",{"$f":"Tecno!B16","v":0},{"$f":"Tecno!C16","v":0},{"$f":"B16*Componentes!$J$12+C16*Componentes!$J$13","v":0},{"$f":"IF(Tecno!E16<>\"\",Tecno!E16,\"\")","v":""},{"$f":"Tecno!F16","v":0},{"$f":"F16*Componentes!$E$56","v":0},{"$f":"IF(Tecno!H16<>\"\",Tecno!H16,\"\")","v":""},{"$f":"Componentes!$J$31*C16","v":0},0]
["Subsolagem",{"$f":"Tecno!B17","v":0},{"$f":"Tecno!C17","v":0},{"$f":"B17*Componentes!$J$12+C17*Componentes!$J$13","v":0},{"$f":"IF(Tecno!E17<>\"\",Tecno!E17,\"\")","v":""},{"$f":"Tecno!F17","v":0},null,{"$f":"IF(Tecno!H17<>\"\",Tecno!H17,\"\")","v":""},{"$f":"Componentes!J40*C17","v":0},0]
["Coveamento",{"$f":"Tecno!B18","v":16},{"$f":"Tecno!C18","v":0},{"$f":"B18*Componentes!$J$12+C18*Componentes!$J$13","v":227.99999999999997},{"$f":"IF(Tecno!E18<>\"\",Tecno!E18,\"\")","v":""},{"$f":"Tecno!F18","v":0},null,{"$f":"IF(Tecno!H18<>\"\",Tecno!H18,\"\")","v":""},null,227.99999999999997]
["Adubação",{"$f":"Tecno!B19","v":1.2},{"$f":"Tecno!C19","v":1.2},{"$f":"B19*Componentes!$J$12+C19*Componentes!$J$13","v":28.772354948805457},{"$f":"IF(Tecno!E19<>\"\",Tecno!E19,\"\")","v":"NPK-6:30:6"},{"$f":"Tecno!F19","v":200},{"$f":"F19*Componentes!$E$52/1000","v":200},{"$f":"IF(Tecno!H19<>\"\",Tecno!H19,\"\")","v":"MF 290 + Aplicador Adubo Granulado"},{"$f":"Componentes!J37*C19","v":86.024999999999991},314.79735494880543]
["Plantio",{"$f":"Tecno!B20","v":12},{"$f":"Tecno!C20","v":3},{"$f":"B20*Componentes!$J$12+C20*Componentes!$J$13","v":200.18088737201361},{"$f":"IF(Tecno!E20<>\"\",Tecno!E20,\"\")","v":"Mudas"},{"$f":"Tecno!F20","v":1667},{"$f":"F20*Componentes!E46/1000","v":583.45000000000005},{"$f":"IF(Tecno!H20<>\"\",Tecno!H20,\"\")","v":"Valmet 880 + carreta"},{"$f":"Componentes!J39*C20","v":155.39999999999998},{"$f":"D20+G20+I20","v":939.03088737201358}]
["Irrigação",{"$f":"Tecno!B21","v":0},{"$f":"Tecno!C21","v":0},{"$f":"B21*Componentes!$J$12+C21*Componentes!$J$13","v":0},{"$f":"IF(Tecno!E21<>\"\",Tecno!E21,\"\")","v":""},{"$f":"Tecno!F21","v":0},null,{"$f":"IF(Tecno!H21<>\"\",Tecno!H21,\"\")","v":""},{"$f":"1.31*Componentes!J31","v":57.558125000000004},{"$f":"D21+G21+I21","v":57.558125000000004}]
["Levantamento Sobrevivência",{"$f":"Tecno!B22","v":0},{"$f":"Tecno!C22","v":0},{"$f":"B22*Componentes!$J$12+C22*Componentes!$J$13","v":0},{"$f":"IF(Tecno!E22<>\"\",Tecno!E22,\"\")","v":""},{"$f":"Tecno!F22","v":0},null,{"$f":"IF(Tecno!H22<>\"\",Tecno!H22,\"\")","v":""}]
["Replantio",{"$f":"Tecno!B23","v":0},{"$f":"Tecno!C23","v":0},{"$f":"B23*Componentes!$J$12+C23*Componentes!$J$13","v":0},{"$f":"IF(Tecno!E23<>\"\",Tecno!E23,\"\")","v":""},{"$f":"Tecno!F23","v":0},null,{"$f":"IF(Tecno!H23<>\"\",Tecno!H23,\"\")","v":""},{"$f":"Componentes!J39*C23","v":0},{"$f":"D23+G23+I23","v":0}]
["Adubação cobertura",{"$f":"Tecno!B24","v":0},{"$f":"Tecno!C24","v":0},{"$f":"B24*Componentes!$J$12+C24*Componentes!$J$13","v":0},{"$f":"IF(Tecno!E24<>\"\",Tecno!E24,\"\")","v":""},{"$f":"Tecno!F24","v":0},{"$f":"F24*Componentes!E54/1000","v":0},{"$f":"IF(Tecno!H24<>\"\",Tecno!H24,\"\")","v":""},{"$f":"Componentes!J37*C24","v":0},{"$f":"D24+G24+I24","v":0}]
["Primeira Manutenção",null,null,null,null,null,null,null,null,{"$f":"SUM(J10:J24)+Componentes!$H$4","v":2290.6187222696244}]
[]
["Conservação do Solo",{"$f":"Tecno!B27","v":0},{"$f":"Tecno!C27","v":0},{"$f":"B27*Componentes!$J$12+C27*Componentes!$J$13","v":0},{"$f":"IF(Tecno!E27<>\"\",Tecno!E27,\"\")","v":""},{"$f":"Tecno!F27","v":0},null,{"$f":"IF(Tecno!H27<>\"\",Tecno!H27,\"\")","v":""},{"$f":"Componentes!$J$29*C27","v":0},{"$f":"D27+G27+I27","v":0}]
["Controle Químico Linha ",{"$f":"Tecno!B28","v":6},{"$f":"Tecno!C28","v":0},{"$f":"B28*Componentes!$J$12+C28*Componentes!$J$13","v":85.499999999999986},{"$f":"IF(Tecno!E28<>\"\",Tecno!E28,\"\")","v":"Round up"},{"$f":"Tecno!F28","v":0.94},{"$f":"F28*Componentes!$E$56","v":63.778999999999989},{"$f":"IF(Tecno!H28<>\"\",Tecno!H28,\"\")","v":"Pulverizador costal motorizado"},{"$f":"Componentes!J23*B28","v":21.3675},170.64649999999997]
["Controle Químico Entrelinha",{"$f":"Tecno!B29","v":0},{"$f":"Tecno!C29","v":0},{"$f":"B29*Componentes!$J$12+C29*Componentes!$J$13","v":0},{"$f":"IF(Tecno!E29<>\"\",Tecno!E29,\"\")","v":""},{"$f":"Tecno!F29","v":0},{"$f":"F29*Componentes!$E$56","v":0},{"$f":"IF(Tecno!H29<>\"\",Tecno!H29,\"\")","v":""},{"$f":"Componentes!$J$31*C29","v":0},0]
["Controle de formigas",{"$f":"Tecno!B30","v":1.8},{"$f":"Tecno!C30","v":0},{"$f":"B30*Componentes!$J$12+C30*Componentes!$J$13","v":25.65},{"$f":"IF(Tecno!E30<>\"\",Tecno!E30,\"\")","v":"Formicida granulado"},{"$f":"Tecno!F30","v":0.7},{"$f":"F30*Componentes!$E$55","v":30.869999999999997},{"$f":"IF(Tecno!H30<>\"\",Tecno!H30,\"\")","v":"Caminhão + Carreta 4 ton."},null,56.519999999999996]
["Adubação de reforço manual",{"$f":"Tecno!B31","v":11.63},{"$f":"Tecno!C31","v":0.94},{"$f":"B31*Componentes!$J$12+C31*Componentes!$J$13","v":174.8708447098976},{"$f":"IF(Tecno!E31<>\"\",Tecno!E31,\"\")","v":"NPK-6:30:6"},{"$f":"Tecno!F31","v":200},{"$f":"F31*Componentes!$E$52/1000","v":200},{"$f":"IF(Tecno!H31<>\"\",Tecno!H31,\"\")","v":""},null,374.8708447098976]
["Manutenção de Aceiros",{"$f":"Tecno!B32","v":0},{"$f":"Tecno!C32","v":0},{"$f":"B32*Componentes!$J$12+C32*Componentes!$J$13","v":0},{"$f":"IF(Tecno!E32<>\"\",Tecno!E32,\"\")","v":""},{"$f":"Tecno!F32","v":0},null,{"$f":"IF(Tecno!H32<>\"\",Tecno!H32,\"\")","v":""},{"$f":"Componentes!$J$29*C32","v":0},0]
["Segunda Manutenção",null,null,null,null,null,null,null,null,{"$f":"SUM(J27:J32)+Componentes!$H$4","v":802.03734470989752}]
[]
["Controle Químico Entrelinha",{"$f":"Tecno!B35","v":0},{"$f":"Tecno!C35","v":0},{"$f":"B35*Componentes!$J$12+C35*Componentes!$J$13","v":0},{"$f":"IF(Tecno!E35<>\"\",Tecno!E35,\"\")","v":""},{"$f":"Tecno!F35","v":0},{"$f":"F35*Componentes!$E$56","v":0},{"$f":"IF(Tecno!H35<>\"\",Tecno!H35,\"\")","v":""},{"$f":"Componentes!$J$31*C35","v":0},{"$f":"D35+G35+I35","v":0}]
["Fosfatagem",{"$f":"Tecno!B36","v":0},{"$f":"Tecno!C36","v":0},{"$f":"B36*Componentes!$J$12+C36*Componentes!$J$13","v":0},{"$f":"IF(Tecno!E36<>\"\",Tecno!E36,\"\")","v":""},{"$f":"Tecno!F36","v":0},{"$f":"F36*Componentes!$E$50/1000","v":0},{"$f":"IF(Tecno!H36<>\"\",Tecno!H36,\"\")","v":""},{"$f":"Componentes!$J$37*C36","v":0},{"$f":"D36+G36+I36","v":0}]
["Roçada Manual Linha",{"$f":"Tecno!B37","v":8},{"$f":"Tecno!C37","v":0},{"$f":"B37*Componentes!$J$12+C37*Componentes!$J$13","v":113.99999999999999},{"$f":"IF(Tecno!E37<>\"\",Tecno!E37,\"\")","v":""},{"$f":"Tecno!F37","v":0},null,{"$f":"IF(Tecno!H37<>\"\",Tecno!H37,\"\")","v":""},null,{"$f":"D37+G37+I37","v":113.99999999999999}]
["Patrolamento Aceiro",{"$f":"Tecno!B38","v":0},{"$f":"Tecno!C38","v":0},{"$f":"B38*Componentes!$J$12+C38*Componentes!$J$13","v":0},{"$f":"IF(Tecno!E38<>\"\",Tecno!E38,\"\")","v":""},{"$f":"Tecno!F38","v":0},null,{"$f":"IF(Tecno!H38<>\"\",Tecno!H38,\"\")","v":""},{"$f":"Componentes!$J$28*C38","v":0},{"$f":"D38+G38+I38","v":0}]
["Terceira Manutenção",null,null,null,null,null,null,null,null,{"$f":"SUM(J35:J38)+Componentes!$H$4","v":314}]
[]
["Controle Químico Entrelinha",{"$f":"Tecno!B41","v":0},{"$f":"Tecno!C41","v":0},{"$f":"B41*Componentes!$J$12+C41*Componentes!$J$13","v":0},{"$f":"IF(Tecno!E41<>\"\",Tecno!E41,\"\")","v":""},{"$f":"Tecno!F41","v":0},{"$f":"F41*Componentes!$E$56","v":0},{"$f":"IF(Tecno!H41<>\"\",Tecno!H41,\"\")","v":""},{"$f":"Componentes!$J$31*C41","v":0},{"$f":"D41+G41+I41","v":0}]
["Adubação de Manutenção",{"$f":"Tecno!B42","v":0},{"$f":"Tecno!C42","v":0},{"$f":"B42*Componentes!$J$12+C42*Componentes!$J$13","v":0},{"$f":"IF(Tecno!E42<>\"\",Tecno!E42,\"\")","v":""},{"$f":"Tecno!F42","v":0},{"$f":"F42*Componentes!$E$53/1000","v":0},{"$f":"IF(Tecno!H42<>\"\",Tecno!H42,\"\")","v":""},{"$f":"Componentes!$J$31*C42","v":0},{"$f":"D42+G42+I42","v":0}]
["Controle formiga manutenção",{"$f":"Tecno!B43","v":1.4},{"$f":"Tecno!C43","v":0},{"$f":"B43*Componentes!$J$12+C43*Componentes!$J$13","v":19.949999999999996},{"$f":"IF(Tecno!E43<>\"\",Tecno!E43,\"\")","v":"Formicida granulado"},{"$f":"Tecno!F43","v":0.6},{"$f":"F43*Componentes!$E$55","v":26.46},{"$f":"IF(Tecno!H43<>\"\",Tecno!H43,\"\")","v":""},null,{"$f":"D43+G43+I43","v":46.41}]
["Patrolamento Aceiro",{"$f":"Tecno!B44","v":0},{"$f":"Tecno!C44","v":0},{"$f":"B44*Componentes!$J$12+C44*Componentes!$J$13","v":0},{"$f":"IF(Tecno!E44<>\"\",Tecno!E44,\"\")","v":""},{"$f":"Tecno!F44","v":0},null,{"$f":"IF(Tecno!H44<>\"\",Tecno!H44,\"\")","v":""},{"$f":"Componentes!$J$28*C44","v":0},{"$f":"D44+G44+I44","v":0}]
["Demais Manutenções",null,null,null,null,null,null,null,null,{"$f":"SUM(J41:J44)+Componentes!$H$4","v":246.41}]
[]
["Controle formiga manutenção",{"$f":"Tecno!B47","v":1.4},{"$f":"Tecno!C47","v":0},{"$f":"B47*Componentes!$J$12+C47*Componentes!$J$13","v":19.949999999999996},{"$f":"IF(Tecno!E47<>\"\",Tecno!E47,\"\")","v":"Formicida granulado"},{"$f":"Tecno!F47","v":0.6},{"$f":"F47*Componentes!$E$55","v":26.46},{"$f":"IF(Tecno!H47<>\"\",Tecno!H47,\"\")","v":""},null,{"$f":"D47+G47+I47","v":46.41}]
["Patrolamento Aceiro",{"$f":"Tecno!B48","v":0},{"$f":"Tecno!C48","v":0},{"$f":"B48*Componentes!$J$12+C48*Componentes!$J$13","v":0},{"$f":"IF(Tecno!E48<>\"\",Tecno!E48,\"\")","v":""},{"$f":"Tecno!F48","v":0},null,{"$f":"IF(Tecno!H48<>\"\",Tecno!H48,\"\")","v":""},{"$f":"Componentes!$J$28*C48","v":0},{"$f":"D48+G48+I48","v":0}]
[null,null,null,null,null,null,null,null,null,{"$f":"SUM(J47:J48)+Componentes!$H$4","v":246.41}]

{"sheet":"EucPol2Rot","index":5,"n_rows":75,"n_cols":10,"rows_kept":75,"cut":false,"hidden":false,"merged":[[32,0,33,0],[38,0,39,0],[57,4,57,6],[38,4,38,6],[70,0,71,0],[32,1,32,3],[38,1,38,3],[44,1,44,3],[50,1,50,3],[57,1,57,3],[64,1,64,3],[70,1,70,3],[44,0,45,0],[57,0,58,0],[50,0,51,0],[64,0,65,0],[7,0,8,0],[24,0,25,0],[0,0,0,6],[1,0,1,6],[3,0,3,6],[7,1,7,3],[7,4,7,6],[4,0,4,6],[2,0,2,6],[24,4,24,6],[24,1,24,3],[7,7,7,8],[50,4,50,6],[50,7,50,8],[32,4,32,6],[24,7,24,8],[32,7,32,8],[38,7,38,8],[44,4,44,6],[44,7,44,8],[70,4,70,6],[70,7,70,8],[57,7,57,8],[64,4,64,6],[64,7,64,8]]}
["Detalhamento dos Custos das Operações - Eucalipto p/ Polpa - Ciclos c/ 2 Rotações"]
["(Rendimento técnico da MDO em homem-hora/hectare)"]
["(Para MDO, considerou-se apenas MDO tipo braçal e tratorista)"]
["(Rendimento técnico do equipamento em hora-máquina/hectare)"]
["(Custo total da operação em $/hectare)"]
[]
["PRIMEIRA ROTAÇÃO",null,null,"Volume aos 7 anos (m3):",253.69746857463767]
["Plantio","Mão-de-Obra",null,null,"Insumo",null,null,"Máquinas"]
[null,"Braçal","Tratorista","Custo","Produto","Quantidade","Custo","Equipamento","Custo","Custo Total"]
["Conservação do Solo",{"$f":"Tecno!B10","v":0},{"$f":"Tecno!C10","v":0},{"$f":"B10*Componentes!$J$12+C10*Componentes!$J$13","v":0},{"$f":"IF(Tecno!E10<>\"\",Tecno!E10,\"\")","v":""},{"$f":"Tecno!F10","v":0},null,{"$f":"IF(Tecno!H10<>\"\",Tecno!H10,\"\")","v":""},{"$f":"Componentes!J29*C10","v":0},{"$f":"D10+G10+I10","v":0}]
["Construção de Aceiros",{"$f":"Tecno!B11","v":0},{"$f":"Tecno!C11","v":0},{"$f":"B11*Componentes!$J$12+C11*Componentes!$J$13","v":0},{"$f":"IF(Tecno!E11<>\"\",Tecno!E11,\"\")","v":""},{"$f":"Tecno!F11","v":0},null,{"$f":"IF(Tecno!H11<>\"\",Tecno!H11,\"\")","v":""},{"$f":"Componentes!J29*C11","v":0},{"$f":"D11+G11+I11","v":0}]
["Calagem",{"$f":"Tecno!B12","v":1.2},{"$f":"Tecno!C12","v":1.2},{"$f":"B12*Componentes!$J$12+C12*Componentes!$J$13","v":28.772354948805457},{"$f":"IF(Tecno!E12<>\"\",Tecno!E12,\"\")","v":"Calcário dolomítico"},{"$f":"Tecno!F12","v":4},{"$f":"F12*Componentes!E47","v":340},{"$f":"IF(Tecno!H12<>\"\",Tecno!H12,\"\")","v":"MF 290 + Aplicador calcário"},{"$f":"Componentes!J36*C12","v":83.25},{"$f":"D12+G12+I12","v":452.02235494880546}]
["Combate a formiga 1",{"$f":"Tecno!B13","v":2.3199999999999998},{"$f":"Tecno!C13","v":0},{"$f":"B13*Componentes!$J$12+C13*Componentes!$J$13","v":33.059999999999995},{"$f":"IF(Tecno!E13<>\"\",Tecno!E13,\"\")","v":"Formicida granulado"},{"$f":"Tecno!F13","v":1.5},{"$f":"F13*Componentes!$E$55","v":66.150000000000006},{"$f":"IF(Tecno!H13<>\"\",Tecno!H13,\"\")","v":""},null,99.210000000000008]
["Combate a formiga 2",{"$f":"Tecno!B14","v":0},{"$f":"Tecno!C14","v":0},{"$f":"B14*Componentes!$J$12+C14*Componentes!$J$13","v":0},{"$f":"IF(Tecno!E14<>\"\",Tecno!E14,\"\")","v":""},{"$f":"Tecno!F14","v":0},{"$f":"F14*Componentes!$E$55","v":0},{"$f":"IF(Tecno!H14<>\"\",Tecno!H14,\"\")","v":""},null,0]
["Combate a formiga 3",{"$f":"Tecno!B15","v":0},{"$f":"Tecno!C15","v":0},{"$f":"B15*Componentes!$J$12+C15*Componentes!$J$13","v":0},{"$f":"IF(Tecno!E15<>\"\",Tecno!E15,\"\")","v":""},{"$f":"Tecno!F15","v":0},{"$f":"F15*Componentes!$E$55","v":0},{"$f":"IF(Tecno!H15<>\"\",Tecno!H15,\"\")","v":""},null,0]
["Controle Químico Mec. Total",{"$f":"Tecno!B16","v":0},{"$f":"Tecno!C16","v":0},{"$f":"B16*Componentes!$J$12+C16*Componentes!$J$13","v":0},{"$f":"IF(Tecno!E16<>\"\",Tecno!E16,\"\")","v":""},{"$f":"Tecno!F16","v":0},{"$f":"F16*Componentes!$E$56","v":0},{"$f":"IF(Tecno!H16<>\"\",Tecno!H16,\"\")","v":""},{"$f":"Componentes!$J$31*C16","v":0},0]
["Subsolagem",{"$f":"Tecno!B17","v":0},{"$f":"Tecno!C17","v":0},{"$f":"B17*Componentes!$J$12+C17*Componentes!$J$13","v":0},{"$f":"IF(Tecno!E17<>\"\",Tecno!E17,\"\")","v":""},{"$f":"Tecno!F17","v":0},null,{"$f":"IF(Tecno!H17<>\"\",Tecno!H17,\"\")","v":""},{"$f":"Componentes!J40*C17","v":0},0]
["Coveamento",{"$f":"Tecno!B18","v":16},{"$f":"Tecno!C18","v":0},{"$f":"B18*Componentes!$J$12+C18*Componentes!$J$13","v":227.99999999999997},{"$f":"IF(Tecno!E18<>\"\",Tecno!E18,\"\")","v":""},{"$f":"Tecno!F18","v":0},null,{"$f":"IF(Tecno!H18<>\"\",Tecno!H18,\"\")","v":""},null,227.99999999999997]
["Adubação",{"$f":"Tecno!B19","v":1.2},{"$f":"Tecno!C19","v":1.2},{"$f":"B19*Componentes!$J$12+C19*Componentes!$J$13","v":28.772354948805457},{"$f":"IF(Tecno!E19<>\"\",Tecno!E19,\"\")","v":"NPK-6:30:6"},{"$f":"Tecno!F19","v":200},{"$f":"F19*Componentes!$E$52/1000","v":200},{"$f":"IF(Tecno!H19<>\"\",Tecno!H19,\"\")","v":"MF 290 + Aplicador Adubo Granulado"},{"$f":"Componentes!J37*C19","v":86.024999999999991},314.79735494880543]
["Plantio",{"$f":"Tecno!B20","v":12},{"$f":"Tecno!C20","v":3},{"$f":"B20*Componentes!$J$12+C20*Componentes!$J$13","v":200.18088737201361},{"$f":"IF(Tecno!E20<>\"\",Tecno!E20,\"\")","v":"Mudas"},{"$f":"Tecno!F20","v":1667},{"$f":"F20*Componentes!E46/1000","v":583.45000000000005},{"$f":"IF(Tecno!H20<>\"\",Tecno!H20,\"\")","v":"Valmet 880 + carreta"},{"$f":"Componentes!J39*C20","v":155.39999999999998},{"$f":"D20+G20+I20","v":939.03088737201358}]
["Irrigação",{"$f":"Tecno!B21","v":0},{"$f":"Tecno!C21","v":0},{"$f":"B21*Componentes!$J$12+C21*Componentes!$J$13","v":0},{"$f":"IF(Tecno!E21<>\"\",Tecno!E21,\"\")","v":""},{"$f":"Tecno!F21","v":0},null,{"$f":"IF(Tecno!H21<>\"\",Tecno!H21,\"\")","v":""},{"$f":"1.31*Componentes!J31","v":57.558125000000004},{"$f":"D21+G21+I21","v":57.558125000000004}]
["Levantamento Sobrevivência",{"$f":"Tecno!B22","v":0},{"$f":"Tecno!C22","v":0},{"$f":"B22*Componentes!$J$12+C22*Componentes!$J$13","v":0},{"$f":"IF(Tecno!E22<>\"\",Tecno!E22,\"\")","v":""},{"$f":"Tecno!F22","v":0},null,{"$f":"IF(Tecno!H22<>\"\",Tecno!H22,\"\")","v":""}]
["Replantio",{"$f":"Tecno!B23","v":0},{"$f":"Tecno!C23","v":0},{"$f":"B23*Componentes!$J$12+C23*Componentes!$J$13","v":0},{"$f":"IF(Tecno!E23<>\"\",Tecno!E23,\"\")","v":""},{"$f":"Tecno!F23","v":0},null,{"$f":"IF(Tecno!H23<>\"\",Tecno!H23,\"\")","v":""},{"$f":"Componentes!J39*C23","v":0},{"$f":"D23+G23+I23","v":0}]
["Adubação cobertura",{"$f":"Tecno!B24","v":0},{"$f":"Tecno!C24","v":0},{"$f":"B24*Componentes!$J$12+C24*Componentes!$J$13","v":0},{"$f":"IF(Tecno!E24<>\"\",Tecno!E24,\"\")","v":""},{"$f":"Tecno!F24","v":0},{"$f":"F24*Componentes!E54/1000","v":0},{"$f":"IF(Tecno!H24<>\"\",Tecno!H24,\"\")","v":""},{"$f":"Componentes!J37*C24","v":0},{"$f":"D24+G24+I24","v":0}]
["Primeira Manutenção",null,null,null,null,null,null,null,null,{"$f":"SUM(J10:J24)+Componentes!$H$4","v":2290.6187222696244}]
[]
["Conservação do Solo",{"$f":"Tecno!B27","v":0},{"$f":"Tecno!C27","v":0},{"$f":"B27*Componentes!$J$12+C27*Componentes!$J$13","v":0},{"$f":"IF(Tecno!E27<>\"\",Tecno!E27,\"\")","v":""},{"$f":"Tecno!F27","v":0},null,{"$f":"IF(Tecno!H27<>\"\",Tecno!H27,\"\")","v":""},{"$f":"Componentes!$J$29*C27","v":0},{"$f":"D27+G27+I27","v":0}]
["Controle Químico Linha ",{"$f":"Tecno!B28","v":6},{"$f":"Tecno!C28","v":0},{"$f":"B28*Componentes!$J$12+C28*Componentes!$J$13","v":85.499999999999986},{"$f":"IF(Tecno!E28<>\"\",Tecno!E28,\"\")","v":"Round up"},{"$f":"Tecno!F28","v":0.94},{"$f":"F28*Componentes!$E$56","v":63.778999999999989},{"$f":"IF(Tecno!H28<>\"\",Tecno!H28,\"\")","v":"Pulverizador costal motorizado"},{"$f":"Componentes!J23*B28","v":21.3675},170.64649999999997]
["Controle Químico Entrelinha",{"$f":"Tecno!B29","v":0},{"$f":"Tecno!C29","v":0},{"$f":"B29*Componentes!$J$12+C29*Componentes!$J$13","v":0},{"$f":"IF(Tecno!E29<>\"\",Tecno!E29,\"\")","v":""},{"$f":"Tecno!F29","v":0},{"$f":"F29*Componentes!$E$56","v":0},{"$f":"IF(Tecno!H29<>\"\",Tecno!H29,\"\")","v":""},{"$f":"Componentes!$J$31*C29","v":0},0]
["Controle de formigas",{"$f":"Tecno!B30","v":1.8},{"$f":"Tecno!C30","v":0},{"$f":"B30*Componentes!$J$12+C30*Componentes!$J$13","v":25.65},{"$f":"IF(Tecno!E30<>\"\",Tecno!E30,\"\")","v":"Formicida granulado"},{"$f":"Tecno!F30","v":0.7},{"$f":"F30*Componentes!$E$55","v":30.869999999999997},{"$f":"IF(Tecno!H30<>\"\",Tecno!H30,\"\")","v":"Caminhão + Carreta 4 ton."},null,56.519999999999996]
["Adubação de reforço manual",{"$f":"Tecno!B31","v":11.63},{"$f":"Tecno!C31","v":0.94},{"$f":"B31*Componentes!$J$12+C31*Componentes!$J$13","v":174.8708447098976},{"$f":"IF(Tecno!E31<>\"\",Tecno!E31,\"\")","v":"NPK-6:30:6"},{"$f":"Tecno!F31","v":200},{"$f":"F31*Componentes!$E$52/1000","v":200},{"$f":"IF(Tecno!H31<>\"\",Tecno!H31,\"\")","v":""},null,374.8708447098976]
["Manutenção de Aceiros",{"$f":"Tecno!B32","v":0},{"$f":"Tecno!C32","v":0},{"$f":"B32*Componentes!$J$12+C32*Componentes!$J$13","v":0},{"$f":"IF(Tecno!E32<>\"\",Tecno!E32,\"\")","v":""},{"$f":"Tecno!F32","v":0},null,{"$f":"IF(Tecno!H32<>\"\",Tecno!H32,\"\")","v":""},{"$f":"Componentes!$J$29*C32","v":0},0]
["Segunda Manutenção",null,null,null,null,null,null,null,null,{"$f":"SUM(J27:J32)+Componentes!$H$4","v":802.03734470989752}]
[]
["Controle Químico Entrelinha",{"$f":"Tecno!B35","v":0},{"$f":"Tecno!C35","v":0},{"$f":"B35*Componentes!$J$12+C35*Componentes!$J$13","v":0},{"$f":"IF(Tecno!E35<>\"\",Tecno!E35,\"\")","v":""},{"$f":"Tecno!F35","v":0},{"$f":"F35*Componentes!$E$56","v":0},{"$f":"IF(Tecno!H35<>\"\",Tecno!H35,\"\")","v":""},{"$f":"Componentes!$J$31*C35","v":0},{"$f":"D35+G35+I35","v":0}]
["Fosfatagem",{"$f":"Tecno!B36","v":0},{"$f":"Tecno!C36","v":0},{"$f":"B36*Componentes!$J$12+C36*Componentes!$J$13","v":0},{"$f":"IF(Tecno!E36<>\"\",Tecno!E36,\"\")","v":""},{"$f":"Tecno!F36","v":0},{"$f":"F36*Componentes!$E$50/1000","v":0},{"$f":"IF(Tecno!H36<>\"\",Tecno!H36,\"\")","v":""},{"$f":"Componentes!$J$37*C36","v":0},{"$f":"D36+G36+I36","v":0}]
["Roçada Manual Linha",{"$f":"Tecno!B37","v":8},{"$f":"Tecno!C37","v":0},{"$f":"B37*Componentes!$J$12+C37*Componentes!$J$13","v":113.99999999999999},{"$f":"IF(Tecno!E37<>\"\",Tecno!E37,\"\")","v":""},{"$f":"Tecno!F37","v":0},null,{"$f":"IF(Tecno!H37<>\"\",Tecno!H37,\"\")","v":""},null,{"$f":"D37+G37+I37","v":113.99999999999999}]
["Patrolamento Aceiro",{"$f":"Tecno!B38","v":0},{"$f":"Tecno!C38","v":0},{"$f":"B38*Componentes!$J$12+C38*Componentes!$J$13","v":0},{"$f":"IF(Tecno!E38<>\"\",Tecno!E38,\"\")","v":""},{"$f":"Tecno!F38","v":0},null,{"$f":"IF(Tecno!H38<>\"\",Tecno!H38,\"\")","v":""},{"$f":"Componentes!$J$28*C38","v":0},{"$f":"D38+G38+I38","v":0}]
["Terceira Manutenção",null,null,null,null,null,null,null,null,{"$f":"SUM(J35:J38)+Componentes!$H$4","v":314}]
[]
["Controle Químico Entrelinha",{"$f":"Tecno!B41","v":0},{"$f":"Tecno!C41","v":0},{"$f":"B41*Componentes!$J$12+C41*Componentes!$J$13","v":0},{"$f":"IF(Tecno!E41<>\"\",Tecno!E41,\"\")","v":""},{"$f":"Tecno!F41","v":0},{"$f":"F41*Componentes!$E$56","v":0},{"$f":"IF(Tecno!H41<>\"\",Tecno!H41,\"\")","v":""},{"$f":"Componentes!$J$31*C41","v":0},{"$f":"D41+G41+I41","v":0}]
["Adubação de Manutenção",{"$f":"Tecno!B42","v":0},{"$f":"Tecno!C42","v":0},{"$f":"B42*Componentes!$J$12+C42*Componentes!$J$13","v":0},{"$f":"IF(Tecno!E42<>\"\",Tecno!E42,\"\")","v":""},{"$f":"Tecno!F42","v":0},{"$f":"F42*Componentes!$E$53/1000","v":0},{"$f":"IF(Tecno!H42<>\"\",Tecno!H42,\"\")","v":""},{"$f":"Componentes!$J$31*C42","v":0},{"$f":"D42+G42+I42","v":0}]
["Controle formiga manutenção",{"$f":"Tecno!B43","v":1.4},{"$f":"Tecno!C43","v":0},{"$f":"B43*Componentes!$J$12+C43*Componentes!$J$13","v":19.949999999999996},{"$f":"IF(Tecno!E43<>\"\",Tecno!E43,\"\")","v":"Formicida granulado"},{"$f":"Tecno!F43","v":0.6},{"$f":"F43*Componentes!$E$55","v":26.46},{"$f":"IF(Tecno!H43<>\"\",Tecno!H43,\"\")","v":""},null,{"$f":"D43+G43+I43","v":46.41}]
["Patrolamento Aceiro",{"$f":"Tecno!B44","v":0},{"$f":"Tecno!C44","v":0},{"$f":"B44*Componentes!$J$12+C44*Componentes!$J$13","v":0},{"$f":"IF(Tecno!E44<>\"\",Tecno!E44,\"\")","v":""},{"$f":"Tecno!F44","v":0},null,{"$f":"IF(Tecno!H44<>\"\",Tecno!H44,\"\")","v":""},{"$f":"Componentes!$J$28*C44","v":0},{"$f":"D44+G44+I44","v":0}]
["Demais Manutenções",null,null,null,null,null,null,null,null,{"$f":"SUM(J41:J44)+Componentes!$H$4","v":246.41}]
[]
["Controle formiga manutenção",{"$f":"Tecno!B47","v":1.4},{"$f":"Tecno!C47","v":0},{"$f":"B47*Componentes!$J$12+C47*Componentes!$J$13","v":19.949999999999996},{"$f":"IF(Tecno!E47<>\"\",Tecno!E47,\"\")","v":"Formicida granulado"},{"$f":"Tecno!F47","v":0.6},{"$f":"F47*Componentes!$E$55","v":26.46},{"$f":"IF(Tecno!H47<>\"\",Tecno!H47,\"\")","v":""},null,{"$f":"D47+G47+I47","v":46.41}]
["Patrolamento Aceiro",{"$f":"Tecno!B48","v":0},{"$f":"Tecno!C48","v":0},{"$f":"B48*Componentes!$J$12+C48*Componentes!$J$13","v":0},{"$f":"IF(Tecno!E48<>\"\",Tecno!E48,\"\")","v":""},{"$f":"Tecno!F48","v":0},null,{"$f":"IF(Tecno!H48<>\"\",Tecno!H48,\"\")","v":""},{"$f":"Componentes!$J$28*C48","v":0},{"$f":"D48+G48+I48","v":0}]
[null,null,null,null,null,null,null,null,null,{"$f":"SUM(J47:J48)+Componentes!$H$4","v":246.41}]
["SEGUNDA ROTAÇÃO",null,null,"Volume aos 7 anos (m3):",236.72212756137861]
["Primeira Manutenção","Mão-de-Obra",null,null,"Insumo",null,null,"Máquinas"]
[null,"Braçal","Tratorista","Custo","Produto","Quantidade","Custo","Equipamento","Custo","Custo Total"]
["Controle Químico Linha ",{"$f":"Tecno!B53","v":6},{"$f":"Tecno!C53","v":0},{"$f":"B53*Componentes!$J$12+C53*Componentes!$J$13","v":85.499999999999986},{"$f":"IF(Tecno!E53<>\"\",Tecno!E53,\"\")","v":"Round up"},{"$f":"Tecno!F53","v":0.94},{"$f":"F53*Componentes!$E$56","v":63.778999999999989},{"$f":"IF(Tecno!H53<>\"\",Tecno!H53,\"\")","v":""},null,{"$f":"D53+G53+I53","v":149.27899999999997}]
["Controle Químico Entrelinha",{"$f":"Tecno!B54","v":0},{"$f":"Tecno!C54","v":0},{"$f":"B54*Componentes!$J$12+C54*Componentes!$J$13","v":0},{"$f":"IF(Tecno!E54<>\"\",Tecno!E54,\"\")","v":""},{"$f":"Tecno!F54","v":0},{"$f":"F54*Componentes!$E$56","v":0},{"$f":"IF(Tecno!H54<>\"\",Tecno!H54,\"\")","v":""},{"$f":"Componentes!$J$31*C54","v":0},{"$f":"D54+G54+I54","v":0}]
["Controle de formigas",{"$f":"Tecno!B55","v":1.8},{"$f":"Tecno!C55","v":0},{"$f":"B55*Componentes!$J$12+C55*Componentes!$J$13","v":25.65},{"$f":"IF(Tecno!E55<>\"\",Tecno!E55,\"\")","v":"Formicida granulado"},{"$f":"Tecno!F55","v":0.7},{"$f":"F55*Componentes!$E$55","v":30.869999999999997},{"$f":"IF(Tecno!H55<>\"\",Tecno!H55,\"\")","v":""},null,{"$f":"D55+G55+I55","v":56.519999999999996}]
["Adubação de Manutenção",{"$f":"Tecno!B56","v":0.1},{"$f":"Tecno!C56","v":0.42},{"$f":"B56*Componentes!$J$12+C56*Componentes!$J$13","v":5.5103242320819108},{"$f":"IF(Tecno!E56<>\"\",Tecno!E56,\"\")","v":"NPK-8:5:18 líquido"},{"$f":"Tecno!F56","v":200},{"$f":"F56*Componentes!$E$53/1000","v":200},{"$f":"IF(Tecno!H56<>\"\",Tecno!H56,\"\")","v":"Trator Médio + Tanque pulverizador com 2 mangueiras"},{"$f":"Componentes!$J$31*C56","v":18.453749999999999},{"$f":"D56+G56+I56","v":223.96407423208188}]
["Patrolamento Aceiro",{"$f":"Tecno!B57","v":0},{"$f":"Tecno!C57","v":0},{"$f":"B57*Componentes!$J$12+C57*Componentes!$J$13","v":0},{"$f":"IF(Tecno!E57<>\"\",Tecno!E57,\"\")","v":""},{"$f":"Tecno!F57","v":0},null,{"$f":"IF(Tecno!H57<>\"\",Tecno!H57,\"\")","v":""},{"$f":"Componentes!$J$28*C57","v":0},{"$f":"D57+G57+I57","v":0}]
["Segunda Manutenção",null,null,null,null,null,null,null,null,{"$f":"SUM(J53:J57)+Componentes!$H$4","v":629.76307423208186}]
[]
["Controle Químico Entrelinha",{"$f":"Tecno!B60","v":0},{"$f":"Tecno!C60","v":0},{"$f":"B60*Componentes!$J$12+C60*Componentes!$J$13","v":0},{"$f":"IF(Tecno!E60<>\"\",Tecno!E60,\"\")","v":""},{"$f":"Tecno!F60","v":0},{"$f":"F60*Componentes!$E$56","v":0},{"$f":"IF(Tecno!H60<>\"\",Tecno!H60,\"\")","v":""},{"$f":"Componentes!$J$31*C60","v":0},{"$f":"D60+G60+I60","v":0}]
["Fosfatagem",{"$f":"Tecno!B61","v":0.66},{"$f":"Tecno!C61","v":1.02},{"$f":"B61*Componentes!$J$12+C61*Componentes!$J$13","v":19.326501706484642},{"$f":"IF(Tecno!E61<>\"\",Tecno!E61,\"\")","v":"Superfosfato Simples"},{"$f":"Tecno!F61","v":300},{"$f":"Componentes!$E$50/1000*F61","v":247.17},{"$f":"IF(Tecno!H61<>\"\",Tecno!H61,\"\")","v":"MF 290 + Aplicador Adubo Granulado"},{"$f":"Componentes!$J$37*C61","v":73.121250000000003},{"$f":"D61+G61+I61","v":339.61775170648468}]
["Desbrota",{"$f":"Tecno!B62","v":12},{"$f":"Tecno!C62","v":0},{"$f":"B62*Componentes!$J$12+C62*Componentes!$J$13","v":170.99999999999997},{"$f":"IF(Tecno!E62<>\"\",Tecno!E62,\"\")","v":""},{"$f":"Tecno!F62","v":0},null,{"$f":"IF(Tecno!H62<>\"\",Tecno!H62,\"\")","v":"Motoroçadeira"},{"$f":"Componentes!J23*B62","v":42.734999999999999},{"$f":"D62+G62+I62","v":213.73499999999996}]
["Roçada Manual Linha",{"$f":"Tecno!B63","v":4},{"$f":"Tecno!C63","v":0},{"$f":"B63*Componentes!$J$12+C63*Componentes!$J$13","v":56.999999999999993},{"$f":"IF(Tecno!E63<>\"\",Tecno!E63,\"\")","v":""},{"$f":"Tecno!F63","v":0},null,{"$f":"IF(Tecno!H63<>\"\",Tecno!H63,\"\")","v":""},null,{"$f":"D63+G63+I63","v":56.999999999999993}]
["Patrolamento Aceiro",{"$f":"Tecno!B64","v":0},{"$f":"Tecno!C64","v":0},{"$f":"B64*Componentes!$J$12+C64*Componentes!$J$13","v":0},{"$f":"IF(Tecno!E64<>\"\",Tecno!E64,\"\")","v":""},{"$f":"Tecno!F64","v":0},null,{"$f":"IF(Tecno!H64<>\"\",Tecno!H64,\"\")","v":""},{"$f":"Componentes!$J$28*C64","v":0},{"$f":"D64+G64+I64","v":0}]
["Terceira Manutenção",null,null,null,null,null,null,null,null,{"$f":"SUM(J60:J64)+Componentes!$H$4","v":810.3527517064847}]
[]
["Controle Químico Entrelinha",{"$f":"Tecno!B67","v":0},{"$f":"Tecno!C67","v":0},{"$f":"B67*Componentes!$J$12+C67*Componentes!$J$13","v":0},{"$f":"IF(Tecno!E67<>\"\",Tecno!E67,\"\")","v":""},{"$f":"Tecno!F67","v":0},{"$f":"F67*Componentes!$E$56","v":0},{"$f":"IF(Tecno!H67<>\"\",Tecno!H67,\"\")","v":""},{"$f":"Componentes!$J$31*C67","v":0},{"$f":"D67+G67+I67","v":0}]
["Adubação de Manutenção",{"$f":"Tecno!B68","v":0},{"$f":"Tecno!C68","v":0},{"$f":"B68*Componentes!$J$12+C68*Componentes!$J$13","v":0},{"$f":"IF(Tecno!E68<>\"\",Tecno!E68,\"\")","v":""},{"$f":"Tecno!F68","v":0},null,{"$f":"IF(Tecno!H68<>\"\",Tecno!H68,\"\")","v":""},{"$f":"Componentes!$J$31*C68","v":0},{"$f":"D68+G68+I68","v":0}]
["Controle formiga manutenção",{"$f":"Tecno!B69","v":1.4},{"$f":"Tecno!C69","v":0},{"$f":"B69*Componentes!$J$12+C69*Componentes!$J$13","v":19.949999999999996},{"$f":"IF(Tecno!E69<>\"\",Tecno!E69,\"\")","v":"Formicida granulado"},{"$f":"Tecno!F69","v":0.6},{"$f":"F69*Componentes!$E$55","v":26.46},{"$f":"IF(Tecno!H69<>\"\",Tecno!H69,\"\")","v":""},null,{"$f":"D69+G69+I69","v":46.41}]
["Patrolamento Aceiro",{"$f":"Tecno!B70","v":0},{"$f":"Tecno!C70","v":0},{"$f":"B70*Componentes!$J$12+C70*Componentes!$J$13","v":0},{"$f":"IF(Tecno!E70<>\"\",Tecno!E70,\"\")","v":""},{"$f":"Tecno!F70","v":0},null,{"$f":"IF(Tecno!H70<>\"\",Tecno!H70,\"\")","v":""},{"$f":"Componentes!$J$28*C70","v":0},{"$f":"D70+G70+I70","v":0}]
["Demais Manutenções",null,null,null,null,null,null,null,null,{"$f":"SUM(J67:J70)+Componentes!$H$4","v":246.41}]
[]
["Controle formiga manutenção",{"$f":"Tecno!B73","v":1.4},{"$f":"Tecno!C73","v":0},{"$f":"B73*Componentes!$J$12+C73*Componentes!$J$13","v":19.949999999999996},{"$f":"IF(Tecno!E73<>\"\",Tecno!E73,\"\")","v":"Formicida granulado"},{"$f":"Tecno!F73","v":0.6},{"$f":"F73*Componentes!$E$55","v":26.46},{"$f":"IF(Tecno!H73<>\"\",Tecno!H73,\"\")","v":""},null,{"$f":"D73+G73+I73","v":46.41}]
["Patrolamento Aceiro",{"$f":"Tecno!B74","v":0},{"$f":"Tecno!C74","v":0},{"$f":"B74*Componentes!$J$12+C74*Componentes!$J$13","v":0},{"$f":"IF(Tecno!E74<>\"\",Tecno!E74,\"\")","v":""},{"$f":"Tecno!F74","v":0},null,{"$f":"IF(Tecno!H74<>\"\",Tecno!H74,\"\")","v":""},{"$f":"Componentes!$J$28*C74","v":0},{"$f":"D74+G74+I74","v":0}]
[null,null,null,null,null,null,null,null,null,{"$f":"SUM(J73:J74)+Componentes!$H$4","v":246.41}]

{"sheet":"EucEne1Rot","index":6,"n_rows":49,"n_cols":10,"rows_kept":49,"cut":false,"hidden":false,"merged":[[7,0,8,0],[7,1,7,3],[7,4,7,6],[7,7,7,8],[24,0,25,0],[24,1,24,3],[24,4,24,6],[0,0,0,6],[1,0,1,6],[2,0,2,6],[3,0,3,6],[4,0,4,6],[44,0,45,0],[44,1,44,3],[44,4,44,6],[44,7,44,8],[24,7,24,8],[38,0,39,0],[38,1,38,3],[38,4,38,6],[38,7,38,8],[32,0,33,0],[32,1,32,3],[32,4,32,6],[32,7,32,8]]}
["Detalhamento dos Custos das Operações - Eucalipto p/ Energia - Ciclos c/ 1 Rotação"]
["(Rendimento técnico da MDO em homem-hora/hectare)"]
["(Para MDO, considerou-se apenas MDO tipo braçal e tratorista)"]
["(Rendimento técnico do equipamento em hora-máquina/hectare)"]
["(Custo total da operação em $/hectare)"]
[]
["PRIMEIRA ROTAÇÃO",null,null,"Volume aos 7 anos (m3):",149.77254683860372]
["Plantio","Mão-de-Obra",null,null,"Insumo",null,null,"Máquinas"]
[null,"Braçal","Tratorista","Custo","Produto","Quantidade","Custo","Equipamento","Custo","Custo Total"]
["Conservação do Solo",{"$f":"Tecno!B10/2","v":0},{"$f":"Tecno!C10/2","v":0},{"$f":"B10*Componentes!$J$12+C10*Componentes!$J$13","v":0},{"$f":"IF(Tecno!E10<>\"\",Tecno!E10,\"\")","v":""},{"$f":"Tecno!F10","v":0},null,{"$f":"IF(Tecno!H10<>\"\",Tecno!H10,\"\")","v":""},{"$f":"Componentes!J29*C10","v":0},{"$f":"D10+G10+I10","v":0}]
["Construção de Aceiros",{"$f":"Tecno!B11/2","v":0},{"$f":"Tecno!C11/2","v":0},{"$f":"B11*Componentes!$J$12+C11*Componentes!$J$13","v":0},{"$f":"IF(Tecno!E11<>\"\",Tecno!E11,\"\")","v":""},{"$f":"Tecno!F11","v":0},null,{"$f":"IF(Tecno!H11<>\"\",Tecno!H11,\"\")","v":""},{"$f":"Componentes!J29*C11","v":0},{"$f":"D11+G11+I11","v":0}]
["Calagem",{"$f":"Tecno!B12","v":1.2},{"$f":"Tecno!C12","v":1.2},{"$f":"B12*Componentes!$J$12+C12*Componentes!$J$13","v":28.772354948805457},{"$f":"IF(Tecno!E12<>\"\",Tecno!E12,\"\")","v":"Calcário dolomítico"},{"$f":"Tecno!F12","v":4},{"$f":"F12*Componentes!E47","v":340},{"$f":"IF(Tecno!H12<>\"\",Tecno!H12,\"\")","v":"MF 290 + Aplicador calcário"},{"$f":"Componentes!J36*C12","v":83.25},{"$f":"D12+G12+I12","v":452.02235494880546}]
["Combate a formiga 1",{"$f":"Tecno!B13","v":2.3199999999999998},{"$f":"Tecno!C13","v":0},{"$f":"B13*Componentes!$J$12+C13*Componentes!$J$13","v":33.059999999999995},{"$f":"IF(Tecno!E13<>\"\",Tecno!E13,\"\")","v":"Formicida granulado"},{"$f":"Tecno!F13","v":1.5},{"$f":"F13*Componentes!$E$55","v":66.150000000000006},{"$f":"IF(Tecno!H13<>\"\",Tecno!H13,\"\")","v":""},null,99.210000000000008]
["Combate a formiga 2",null,null,{"$f":"B14*Componentes!$J$12+C14*Componentes!$J$13","v":0},null,null,{"$f":"F14*Componentes!$E$55","v":0},{"$f":"IF(Tecno!H14<>\"\",Tecno!H14,\"\")","v":""},null,0]
["Combate a formiga 3",null,null,{"$f":"B15*Componentes!$J$12+C15*Componentes!$J$13","v":0},null,null,{"$f":"F15*Componentes!$E$55","v":0},{"$f":"IF(Tecno!H15<>\"\",Tecno!H15,\"\")","v":""},null,0]
["Controle Químico Mec. Total",{"$f":"Tecno!B16","v":0},{"$f":"Tecno!C16","v":0},{"$f":"B16*Componentes!$J$12+C16*Componentes!$J$13","v":0},{"$f":"IF(Tecno!E16<>\"\",Tecno!E16,\"\")","v":""},{"$f":"Tecno!F16","v":0},{"$f":"F16*Componentes!$E$56","v":0},{"$f":"IF(Tecno!H16<>\"\",Tecno!H16,\"\")","v":""},{"$f":"Componentes!$J$31*C16","v":0},0]
["Subsolagem",{"$f":"Tecno!B17","v":0},{"$f":"Tecno!C17","v":0},{"$f":"B17*Componentes!$J$12+C17*Componentes!$J$13","v":0},{"$f":"IF(Tecno!E17<>\"\",Tecno!E17,\"\")","v":""},{"$f":"Tecno!F17","v":0},null,{"$f":"IF(Tecno!H17<>\"\",Tecno!H17,\"\")","v":""},{"$f":"Componentes!J40*C17","v":0},0]
["Coveamento",{"$f":"Tecno!B18","v":16},{"$f":"Tecno!C18","v":0},{"$f":"B18*Componentes!$J$12+C18*Componentes!$J$13","v":227.99999999999997},{"$f":"IF(Tecno!E18<>\"\",Tecno!E18,\"\")","v":""},{"$f":"Tecno!F18","v":0},null,{"$f":"IF(Tecno!H18<>\"\",Tecno!H18,\"\")","v":""},null,227.99999999999997]
["Adubação",{"$f":"Tecno!B19","v":1.2},{"$f":"Tecno!C19","v":1.2},{"$f":"B19*Componentes!$J$12+C19*Componentes!$J$13","v":28.772354948805457},{"$f":"IF(Tecno!E19<>\"\",Tecno!E19,\"\")","v":"NPK-6:30:6"},{"$f":"Tecno!F19","v":200},{"$f":"F19*Componentes!$E$52/1000","v":200},{"$f":"IF(Tecno!H19<>\"\",Tecno!H19,\"\")","v":"MF 290 + Aplicador Adubo Granulado"},{"$f":"Componentes!J37*C19","v":86.024999999999991},314.79735494880543]
["Plantio",{"$f":"Tecno!B20","v":12},{"$f":"Tecno!C20","v":3},{"$f":"B20*Componentes!$J$12+C20*Componentes!$J$13","v":200.18088737201361},{"$f":"IF(Tecno!E20<>\"\",Tecno!E20,\"\")","v":"Mudas"},{"$f":"Tecno!F20","v":1667},{"$f":"F20*Componentes!E46/1000","v":583.45000000000005},{"$f":"IF(Tecno!H20<>\"\",Tecno!H20,\"\")","v":"Valmet 880 + carreta"},{"$f":"Componentes!J39*C20","v":155.39999999999998},{"$f":"D20+G20+I20","v":939.03088737201358}]
["Irrigação",{"$f":"Tecno!B21","v":0},{"$f":"Tecno!C21","v":0},{"$f":"B21*Componentes!$J$12+C21*Componentes!$J$13","v":0},{"$f":"IF(Tecno!E21<>\"\",Tecno!E21,\"\")","v":""},{"$f":"Tecno!F21","v":0},null,{"$f":"IF(Tecno!H21<>\"\",Tecno!H21,\"\")","v":""},{"$f":"1.31*Componentes!J31","v":57.558125000000004},{"$f":"D21+G21+I21","v":57.558125000000004}]
["Levantamento Sobrevivência",{"$f":"Tecno!B22","v":0},{"$f":"Tecno!C22","v":0},{"$f":"B22*Componentes!$J$12+C22*Componentes!$J$13","v":0},{"$f":"IF(Tecno!E22<>\"\",Tecno!E22,\"\")","v":""},{"$f":"Tecno!F22","v":0},null,{"$f":"IF(Tecno!H22<>\"\",Tecno!H22,\"\")","v":""}]
["Replantio",{"$f":"Tecno!B23","v":0},{"$f":"Tecno!C23","v":0},{"$f":"B23*Componentes!$J$12+C23*Componentes!$J$13","v":0},{"$f":"IF(Tecno!E23<>\"\",Tecno!E23,\"\")","v":""},{"$f":"Tecno!F23","v":0},null,{"$f":"IF(Tecno!H23<>\"\",Tecno!H23,\"\")","v":""},{"$f":"Componentes!J39*C23","v":0},{"$f":"D23+G23+I23","v":0}]
["Adubação cobertura",{"$f":"Tecno!B24","v":0},{"$f":"Tecno!C24","v":0},{"$f":"B24*Componentes!$J$12+C24*Componentes!$J$13","v":0},{"$f":"IF(Tecno!E24<>\"\",Tecno!E24,\"\")","v":""},{"$f":"Tecno!F24","v":0},{"$f":"F24*Componentes!E54/1000","v":0},{"$f":"IF(Tecno!H24<>\"\",Tecno!H24,\"\")","v":""},{"$f":"Componentes!J37*C24","v":0},{"$f":"D24+G24+I24","v":0}]
["Primeira Manutenção",null,null,null,null,null,null,null,null,{"$f":"SUM(J10:J24)+Componentes!$H$4","v":2290.6187222696244}]
[]
["Conservação do Solo",{"$f":"Tecno!B27/2","v":0},{"$f":"Tecno!C27/2","v":0},{"$f":"B27*Componentes!$J$12+C27*Componentes!$J$13","v":0},{"$f":"IF(Tecno!E27<>\"\",Tecno!E27,\"\")","v":""},{"$f":"Tecno!F27","v":0},null,{"$f":"IF(Tecno!H27<>\"\",Tecno!H27,\"\")","v":""},{"$f":"Componentes!$J$29*C27","v":0},{"$f":"D27+G27+I27","v":0}]
["Controle Químico Linha ",{"$f":"Tecno!B28","v":6},{"$f":"Tecno!C28","v":0},{"$f":"B28*Componentes!$J$12+C28*Componentes!$J$13","v":85.499999999999986},{"$f":"IF(Tecno!E28<>\"\",Tecno!E28,\"\")","v":"Round up"},{"$f":"Tecno!F28","v":0.94},{"$f":"F28*Componentes!$E$56","v":63.778999999999989},{"$f":"IF(Tecno!H28<>\"\",Tecno!H28,\"\")","v":"Pulverizador costal motorizado"},{"$f":"Componentes!J23*B28","v":21.3675},170.64649999999997]
["Controle Químico Entrelinha",null,null,{"$f":"B29*Componentes!$J$12+C29*Componentes!$J$13","v":0},null,null,{"$f":"F29*Componentes!$E$56","v":0},null,{"$f":"Componentes!$J$31*C29","v":0},0]
["Controle de formigas",{"$f":"Tecno!B30","v":1.8},{"$f":"Tecno!C30","v":0},{"$f":"B30*Componentes!$J$12+C30*Componentes!$J$13","v":25.65},{"$f":"IF(Tecno!E30<>\"\",Tecno!E30,\"\")","v":"Formicida granulado"},{"$f":"Tecno!F30","v":0.7},{"$f":"F30*Componentes!$E$55","v":30.869999999999997},{"$f":"IF(Tecno!H30<>\"\",Tecno!H30,\"\")","v":"Caminhão + Carreta 4 ton."},null,56.519999999999996]
["Adubação de reforço manual",{"$f":"Tecno!B31","v":11.63},{"$f":"Tecno!C31","v":0.94},{"$f":"B31*Componentes!$J$12+C31*Componentes!$J$13","v":174.8708447098976},{"$f":"IF(Tecno!E31<>\"\",Tecno!E31,\"\")","v":"NPK-6:30:6"},{"$f":"Tecno!F31","v":200},{"$f":"F31*Componentes!$E$52/1000","v":200},{"$f":"IF(Tecno!H31<>\"\",Tecno!H31,\"\")","v":""},null,374.8708447098976]
["Manutenção de Aceiros",{"$f":"Tecno!B32/2","v":0},{"$f":"Tecno!C32/2","v":0},{"$f":"B32*Componentes!$J$12+C32*Componentes!$J$13","v":0},{"$f":"IF(Tecno!E32<>\"\",Tecno!E32,\"\")","v":""},{"$f":"Tecno!F32","v":0},null,{"$f":"IF(Tecno!H32<>\"\",Tecno!H32,\"\")","v":""},{"$f":"Componentes!$J$29*C32","v":0},0]
["Segunda Manutenção",null,null,null,null,null,null,null,null,{"$f":"SUM(J27:J32)+Componentes!$H$4","v":802.03734470989752}]
[]
["Controle Químico Entrelinha",{"$f":"Tecno!B35","v":0},{"$f":"Tecno!C35","v":0},{"$f":"B35*Componentes!$J$12+C35*Componentes!$J$13","v":0},{"$f":"IF(Tecno!E35<>\"\",Tecno!E35,\"\")","v":""},{"$f":"Tecno!F35","v":0},{"$f":"F35*Componentes!$E$56","v":0},{"$f":"IF(Tecno!H35<>\"\",Tecno!H35,\"\")","v":""},{"$f":"Componentes!$J$31*C35","v":0},{"$f":"D35+G35+I35","v":0}]
["Fosfatagem",null,null,{"$f":"B36*Componentes!$J$12+C36*Componentes!$J$13","v":0},null,null,{"$f":"F36*Componentes!$E$50/1000","v":0},null,{"$f":"Componentes!$J$37*C36","v":0},{"$f":"D36+G36+I36","v":0}]
["Roçada Manual Linha",{"$f":"Tecno!B37","v":8},{"$f":"Tecno!C37","v":0},{"$f":"B37*Componentes!$J$12+C37*Componentes!$J$13","v":113.99999999999999},{"$f":"IF(Tecno!E37<>\"\",Tecno!E37,\"\")","v":""},{"$f":"Tecno!F37","v":0},null,{"$f":"IF(Tecno!H37<>\"\",Tecno!H37,\"\")","v":""},null,{"$f":"D37+G37+I37","v":113.99999999999999}]
["Patrolamento Aceiro",{"$f":"Tecno!B38","v":0},{"$f":"Tecno!C38","v":0},{"$f":"B38*Componentes!$J$12+C38*Componentes!$J$13","v":0},{"$f":"IF(Tecno!E38<>\"\",Tecno!E38,\"\")","v":""},{"$f":"Tecno!F38","v":0},null,{"$f":"IF(Tecno!H38<>\"\",Tecno!H38,\"\")","v":""},{"$f":"Componentes!$J$28*C38","v":0},{"$f":"D38+G38+I38","v":0}]
["Terceira Manutenção",null,null,null,null,null,null,null,null,{"$f":"SUM(J35:J38)+Componentes!$H$4","v":314}]
[]
["Controle Químico Entrelinha",{"$f":"Tecno!B41","v":0},{"$f":"Tecno!C41","v":0},{"$f":"B41*Componentes!$J$12+C41*Componentes!$J$13","v":0},{"$f":"IF(Tecno!E41<>\"\",Tecno!E41,\"\")","v":""},{"$f":"Tecno!F41","v":0},{"$f":"F41*Componentes!$E$56","v":0},{"$f":"IF(Tecno!H41<>\"\",Tecno!H41,\"\")","v":""},{"$f":"Componentes!$J$31*C41","v":0},{"$f":"D41+G41+I41","v":0}]
["Adubação de Manutenção",null,null,{"$f":"B42*Componentes!$J$12+C42*Componentes!$J$13","v":0},null,null,{"$f":"F42*Componentes!$E$53/1000","v":0},null,{"$f":"Componentes!$J$31*C42","v":0},{"$f":"D42+G42+I42","v":0}]
["Controle formiga manutenção",{"$f":"Tecno!B43","v":1.4},{"$f":"Tecno!C43","v":0},{"$f":"B43*Componentes!$J$12+C43*Componentes!$J$13","v":19.949999999999996},{"$f":"IF(Tecno!E43<>\"\",Tecno!E43,\"\")","v":"Formicida granulado"},{"$f":"Tecno!F43","v":0.6},{"$f":"F43*Componentes!$E$55","v":26.46},{"$f":"IF(Tecno!H43<>\"\",Tecno!H43,\"\")","v":""},null,{"$f":"D43+G43+I43","v":46.41}]
["Patrolamento Aceiro",{"$f":"Tecno!B44","v":0},{"$f":"Tecno!C44","v":0},{"$f":"B44*Componentes!$J$12+C44*Componentes!$J$13","v":0},{"$f":"IF(Tecno!E44<>\"\",Tecno!E44,\"\")","v":""},{"$f":"Tecno!F44","v":0},null,{"$f":"IF(Tecno!H44<>\"\",Tecno!H44,\"\")","v":""},{"$f":"Componentes!$J$28*C44","v":0},{"$f":"D44+G44+I44","v":0}]
["Demais Manutenções",null,null,null,null,null,null,null,null,{"$f":"SUM(J41:J44)+Componentes!$H$4","v":246.41}]
[]
["Controle formiga manutenção",{"$f":"Tecno!B47","v":1.4},{"$f":"Tecno!C47","v":0},{"$f":"B47*Componentes!$J$12+C47*Componentes!$J$13","v":19.949999999999996},{"$f":"IF(Tecno!E47<>\"\",Tecno!E47,\"\")","v":"Formicida granulado"},{"$f":"Tecno!F47","v":0.6},{"$f":"F47*Componentes!$E$55","v":26.46},{"$f":"IF(Tecno!H47<>\"\",Tecno!H47,\"\")","v":""},null,{"$f":"D47+G47+I47","v":46.41}]
["Patrolamento Aceiro",null,null,{"$f":"B48*Componentes!$J$12+C48*Componentes!$J$13","v":0},{"$f":"IF(Tecno!E48<>\"\",Tecno!E48,\"\")","v":""},{"$f":"Tecno!F48","v":0},null,null,{"$f":"Componentes!$J$28*C48","v":0},{"$f":"D48+G48+I48","v":0}]
[null,null,null,null,null,null,null,null,null,{"$f":"SUM(J47:J48)+Componentes!$H$4","v":246.41}]

{"sheet":"EucEne2Rot","index":7,"n_rows":75,"n_cols":10,"rows_kept":75,"cut":false,"hidden":false,"merged":[[7,0,8,0],[7,1,7,3],[7,4,7,6],[7,7,7,8],[24,0,25,0],[24,1,24,3],[24,4,24,6],[24,7,24,8],[0,0,0,6],[1,0,1,6],[2,0,2,6],[3,0,3,6],[4,0,4,6],[38,0,39,0],[38,1,38,3],[38,4,38,6],[38,7,38,8],[32,0,33,0],[32,1,32,3],[32,4,32,6],[32,7,32,8],[44,0,45,0],[44,1,44,3],[44,4,44,6],[44,7,44,8],[50,0,51,0],[50,1,50,3],[50,4,50,6],[50,7,50,8],[70,0,71,0],[70,1,70,3],[70,4,70,6],[70,7,70,8],[57,0,58,0],[57,1,57,3],[57,4,57,6],[57,7,57,8],[64,0,65,0],[64,1,64,3],[64,4,64,6],[64,7,64,8]]}
["Detalhamento dos Custos das Operações - Eucalipto p/ Energia - Ciclos c/ 2 Rotações"]
["(Rendimento técnico da MDO em homem-hora/hectare)"]
["(Para MDO, considerou-se apenas MDO tipo braçal e tratorista)"]
["(Rendimento técnico do equipamento em hora-máquina/hectare)"]
["(Custo total da operação em $/hectare)"]
[]
["PRIMEIRA ROTAÇÃO",null,null,"Volume aos 7 anos (m3):",149.77254683860372]
["Plantio","Mão-de-Obra",null,null,"Insumo",null,null,"Máquinas"]
[null,"Braçal","Tratorista","Custo","Produto","Quantidade","Custo","Equipamento","Custo","Custo Total"]
["Conservação do Solo",{"$f":"Tecno!B10/2","v":0},{"$f":"Tecno!C10/2","v":0},{"$f":"B10*Componentes!$J$12+C10*Componentes!$J$13","v":0},{"$f":"IF(Tecno!E10<>\"\",Tecno!E10,\"\")","v":""},{"$f":"Tecno!F10","v":0},null,{"$f":"IF(Tecno!H10<>\"\",Tecno!H10,\"\")","v":""},{"$f":"Componentes!J29*C10","v":0},{"$f":"D10+G10+I10","v":0}]
["Construção de Aceiros",{"$f":"Tecno!B11/2","v":0},{"$f":"Tecno!C11/2","v":0},{"$f":"B11*Componentes!$J$12+C11*Componentes!$J$13","v":0},{"$f":"IF(Tecno!E11<>\"\",Tecno!E11,\"\")","v":""},{"$f":"Tecno!F11","v":0},null,{"$f":"IF(Tecno!H11<>\"\",Tecno!H11,\"\")","v":""},{"$f":"Componentes!J29*C11","v":0},{"$f":"D11+G11+I11","v":0}]
["Calagem",{"$f":"Tecno!B12","v":1.2},{"$f":"Tecno!C12","v":1.2},{"$f":"B12*Componentes!$J$12+C12*Componentes!$J$13","v":28.772354948805457},{"$f":"IF(Tecno!E12<>\"\",Tecno!E12,\"\")","v":"Calcário dolomítico"},{"$f":"Tecno!F12","v":4},{"$f":"F12*Componentes!E47","v":340},{"$f":"IF(Tecno!H12<>\"\",Tecno!H12,\"\")","v":"MF 290 + Aplicador calcário"},{"$f":"Componentes!J36*C12","v":83.25},{"$f":"D12+G12+I12","v":452.02235494880546}]
["Combate a formiga 1",{"$f":"Tecno!B13","v":2.3199999999999998},{"$f":"Tecno!C13","v":0},{"$f":"B13*Componentes!$J$12+C13*Componentes!$J$13","v":33.059999999999995},{"$f":"IF(Tecno!E13<>\"\",Tecno!E13,\"\")","v":"Formicida granulado"},{"$f":"Tecno!F13","v":1.5},{"$f":"F13*Componentes!$E$55","v":66.150000000000006},{"$f":"IF(Tecno!H13<>\"\",Tecno!H13,\"\")","v":""},null,99.210000000000008]
["Combate a formiga 2",null,null,{"$f":"B14*Componentes!$J$12+C14*Componentes!$J$13","v":0},null,null,{"$f":"F14*Componentes!$E$55","v":0},{"$f":"IF(Tecno!H14<>\"\",Tecno!H14,\"\")","v":""},null,0]
["Combate a formiga 3",null,null,{"$f":"B15*Componentes!$J$12+C15*Componentes!$J$13","v":0},null,null,{"$f":"F15*Componentes!$E$55","v":0},{"$f":"IF(Tecno!H15<>\"\",Tecno!H15,\"\")","v":""},null,0]
["Controle Químico Mec. Total",{"$f":"Tecno!B16","v":0},{"$f":"Tecno!C16","v":0},{"$f":"B16*Componentes!$J$12+C16*Componentes!$J$13","v":0},{"$f":"IF(Tecno!E16<>\"\",Tecno!E16,\"\")","v":""},{"$f":"Tecno!F16","v":0},{"$f":"F16*Componentes!$E$56","v":0},{"$f":"IF(Tecno!H16<>\"\",Tecno!H16,\"\")","v":""},{"$f":"Componentes!$J$31*C16","v":0},0]
["Subsolagem",{"$f":"Tecno!B17","v":0},{"$f":"Tecno!C17","v":0},{"$f":"B17*Componentes!$J$12+C17*Componentes!$J$13","v":0},{"$f":"IF(Tecno!E17<>\"\",Tecno!E17,\"\")","v":""},{"$f":"Tecno!F17","v":0},null,{"$f":"IF(Tecno!H17<>\"\",Tecno!H17,\"\")","v":""},{"$f":"Componentes!J40*C17","v":0},0]
["Coveamento",{"$f":"Tecno!B18","v":16},{"$f":"Tecno!C18","v":0},{"$f":"B18*Componentes!$J$12+C18*Componentes!$J$13","v":227.99999999999997},{"$f":"IF(Tecno!E18<>\"\",Tecno!E18,\"\")","v":""},{"$f":"Tecno!F18","v":0},null,{"$f":"IF(Tecno!H18<>\"\",Tecno!H18,\"\")","v":""},null,227.99999999999997]
["Adubação",{"$f":"Tecno!B19","v":1.2},{"$f":"Tecno!C19","v":1.2},{"$f":"B19*Componentes!$J$12+C19*Componentes!$J$13","v":28.772354948805457},{"$f":"IF(Tecno!E19<>\"\",Tecno!E19,\"\")","v":"NPK-6:30:6"},{"$f":"Tecno!F19","v":200},{"$f":"F19*Componentes!$E$52/1000","v":200},{"$f":"IF(Tecno!H19<>\"\",Tecno!H19,\"\")","v":"MF 290 + Aplicador Adubo Granulado"},{"$f":"Componentes!J37*C19","v":86.024999999999991},314.79735494880543]
["Plantio",{"$f":"Tecno!B20","v":12},{"$f":"Tecno!C20","v":3},{"$f":"B20*Componentes!$J$12+C20*Componentes!$J$13","v":200.18088737201361},{"$f":"IF(Tecno!E20<>\"\",Tecno!E20,\"\")","v":"Mudas"},{"$f":"Tecno!F20","v":1667},{"$f":"F20*Componentes!E46/1000","v":583.45000000000005},{"$f":"IF(Tecno!H20<>\"\",Tecno!H20,\"\")","v":"Valmet 880 + carreta"},{"$f":"Componentes!J39*C20","v":155.39999999999998},{"$f":"D20+G20+I20","v":939.03088737201358}]
["Irrigação",{"$f":"Tecno!B21","v":0},{"$f":"Tecno!C21","v":0},{"$f":"B21*Componentes!$J$12+C21*Componentes!$J$13","v":0},{"$f":"IF(Tecno!E21<>\"\",Tecno!E21,\"\")","v":""},{"$f":"Tecno!F21","v":0},null,{"$f":"IF(Tecno!H21<>\"\",Tecno!H21,\"\")","v":""},{"$f":"1.31*Componentes!J31","v":57.558125000000004},{"$f":"D21+G21+I21","v":57.558125000000004}]
["Levantamento Sobrevivência",{"$f":"Tecno!B22","v":0},{"$f":"Tecno!C22","v":0},{"$f":"B22*Componentes!$J$12+C22*Componentes!$J$13","v":0},{"$f":"IF(Tecno!E22<>\"\",Tecno!E22,\"\")","v":""},{"$f":"Tecno!F22","v":0},null,{"$f":"IF(Tecno!H22<>\"\",Tecno!H22,\"\")","v":""}]
["Replantio",{"$f":"Tecno!B23","v":0},{"$f":"Tecno!C23","v":0},{"$f":"B23*Componentes!$J$12+C23*Componentes!$J$13","v":0},{"$f":"IF(Tecno!E23<>\"\",Tecno!E23,\"\")","v":""},{"$f":"Tecno!F23","v":0},null,{"$f":"IF(Tecno!H23<>\"\",Tecno!H23,\"\")","v":""},{"$f":"Componentes!J39*C23","v":0},{"$f":"D23+G23+I23","v":0}]
["Adubação cobertura",{"$f":"Tecno!B24","v":0},{"$f":"Tecno!C24","v":0},{"$f":"B24*Componentes!$J$12+C24*Componentes!$J$13","v":0},{"$f":"IF(Tecno!E24<>\"\",Tecno!E24,\"\")","v":""},{"$f":"Tecno!F24","v":0},{"$f":"F24*Componentes!E54/1000","v":0},{"$f":"IF(Tecno!H24<>\"\",Tecno!H24,\"\")","v":""},{"$f":"Componentes!J37*C24","v":0},{"$f":"D24+G24+I24","v":0}]
["Primeira Manutenção",null,null,null,null,null,null,null,null,{"$f":"SUM(J10:J24)+Componentes!$H$4","v":2290.6187222696244}]
[]
["Conservação do Solo",{"$f":"Tecno!B27/2","v":0},{"$f":"Tecno!C27/2","v":0},{"$f":"B27*Componentes!$J$12+C27*Componentes!$J$13","v":0},{"$f":"IF(Tecno!E27<>\"\",Tecno!E27,\"\")","v":""},{"$f":"Tecno!F27","v":0},null,{"$f":"IF(Tecno!H27<>\"\",Tecno!H27,\"\")","v":""},{"$f":"Componentes!$J$29*C27","v":0},{"$f":"D27+G27+I27","v":0}]
["Controle Químico Linha ",{"$f":"Tecno!B28","v":6},{"$f":"Tecno!C28","v":0},{"$f":"B28*Componentes!$J$12+C28*Componentes!$J$13","v":85.499999999999986},{"$f":"IF(Tecno!E28<>\"\",Tecno!E28,\"\")","v":"Round up"},{"$f":"Tecno!F28","v":0.94},{"$f":"F28*Componentes!$E$56","v":63.778999999999989},{"$f":"IF(Tecno!H28<>\"\",Tecno!H28,\"\")","v":"Pulverizador costal motorizado"},{"$f":"Componentes!J23*B28","v":21.3675},170.64649999999997]
["Controle Químico Entrelinha",null,null,{"$f":"B29*Componentes!$J$12+C29*Componentes!$J$13","v":0},null,null,{"$f":"F29*Componentes!$E$56","v":0},null,{"$f":"Componentes!$J$31*C29","v":0},0]
["Controle de formigas",{"$f":"Tecno!B30","v":1.8},{"$f":"Tecno!C30","v":0},{"$f":"B30*Componentes!$J$12+C30*Componentes!$J$13","v":25.65},{"$f":"IF(Tecno!E30<>\"\",Tecno!E30,\"\")","v":"Formicida granulado"},{"$f":"Tecno!F30","v":0.7},{"$f":"F30*Componentes!$E$55","v":30.869999999999997},{"$f":"IF(Tecno!H30<>\"\",Tecno!H30,\"\")","v":"Caminhão + Carreta 4 ton."},null,56.519999999999996]
["Adubação de reforço manual",{"$f":"Tecno!B31","v":11.63},{"$f":"Tecno!C31","v":0.94},{"$f":"B31*Componentes!$J$12+C31*Componentes!$J$13","v":174.8708447098976},{"$f":"IF(Tecno!E31<>\"\",Tecno!E31,\"\")","v":"NPK-6:30:6"},{"$f":"Tecno!F31","v":200},{"$f":"F31*Componentes!$E$52/1000","v":200},{"$f":"IF(Tecno!H31<>\"\",Tecno!H31,\"\")","v":""},null,374.8708447098976]
["Manutenção de Aceiros",{"$f":"Tecno!B32/2","v":0},{"$f":"Tecno!C32/2","v":0},{"$f":"B32*Componentes!$J$12+C32*Componentes!$J$13","v":0},{"$f":"IF(Tecno!E32<>\"\",Tecno!E32,\"\")","v":""},{"$f":"Tecno!F32","v":0},null,{"$f":"IF(Tecno!H32<>\"\",Tecno!H32,\"\")","v":""},{"$f":"Componentes!$J$29*C32","v":0},0]
["Segunda Manutenção",null,null,null,null,null,null,null,null,{"$f":"SUM(J27:J32)+Componentes!$H$4","v":802.03734470989752}]
[]
["Controle Químico Entrelinha",{"$f":"Tecno!B35","v":0},{"$f":"Tecno!C35","v":0},{"$f":"B35*Componentes!$J$12+C35*Componentes!$J$13","v":0},{"$f":"IF(Tecno!E35<>\"\",Tecno!E35,\"\")","v":""},{"$f":"Tecno!F35","v":0},{"$f":"F35*Componentes!$E$56","v":0},{"$f":"IF(Tecno!H35<>\"\",Tecno!H35,\"\")","v":""},{"$f":"Componentes!$J$31*C35","v":0},{"$f":"D35+G35+I35","v":0}]
["Fosfatagem",null,null,{"$f":"B36*Componentes!$J$12+C36*Componentes!$J$13","v":0},null,null,{"$f":"F36*Componentes!$E$50/1000","v":0},null,{"$f":"Componentes!$J$37*C36","v":0},{"$f":"D36+G36+I36","v":0}]
["Roçada Manual Linha",{"$f":"Tecno!B37","v":8},{"$f":"Tecno!C37","v":0},{"$f":"B37*Componentes!$J$12+C37*Componentes!$J$13","v":113.99999999999999},{"$f":"IF(Tecno!E37<>\"\",Tecno!E37,\"\")","v":""},{"$f":"Tecno!F37","v":0},null,{"$f":"IF(Tecno!H37<>\"\",Tecno!H37,\"\")","v":""},null,{"$f":"D37+G37+I37","v":113.99999999999999}]
["Patrolamento Aceiro",{"$f":"Tecno!B38","v":0},{"$f":"Tecno!C38","v":0},{"$f":"B38*Componentes!$J$12+C38*Componentes!$J$13","v":0},{"$f":"IF(Tecno!E38<>\"\",Tecno!E38,\"\")","v":""},{"$f":"Tecno!F38","v":0},null,{"$f":"IF(Tecno!H38<>\"\",Tecno!H38,\"\")","v":""},{"$f":"Componentes!$J$28*C38","v":0},{"$f":"D38+G38+I38","v":0}]
["Terceira Manutenção",null,null,null,null,null,null,null,null,{"$f":"SUM(J35:J38)+Componentes!$H$4","v":314}]
[]
["Controle Químico Entrelinha",{"$f":"Tecno!B41","v":0},{"$f":"Tecno!C41","v":0},{"$f":"B41*Componentes!$J$12+C41*Componentes!$J$13","v":0},{"$f":"IF(Tecno!E41<>\"\",Tecno!E41,\"\")","v":""},{"$f":"Tecno!F41","v":0},{"$f":"F41*Componentes!$E$56","v":0},{"$f":"IF(Tecno!H41<>\"\",Tecno!H41,\"\")","v":""},{"$f":"Componentes!$J$31*C41","v":0},{"$f":"D41+G41+I41","v":0}]
["Adubação de Manutenção",null,null,{"$f":"B42*Componentes!$J$12+C42*Componentes!$J$13","v":0},null,null,{"$f":"F42*Componentes!$E$53/1000","v":0},null,{"$f":"Componentes!$J$31*C42","v":0},{"$f":"D42+G42+I42","v":0}]
["Controle formiga manutenção",{"$f":"Tecno!B43","v":1.4},{"$f":"Tecno!C43","v":0},{"$f":"B43*Componentes!$J$12+C43*Componentes!$J$13","v":19.949999999999996},{"$f":"IF(Tecno!E43<>\"\",Tecno!E43,\"\")","v":"Formicida granulado"},{"$f":"Tecno!F43","v":0.6},{"$f":"F43*Componentes!$E$55","v":26.46},{"$f":"IF(Tecno!H43<>\"\",Tecno!H43,\"\")","v":""},null,{"$f":"D43+G43+I43","v":46.41}]
["Patrolamento Aceiro",{"$f":"Tecno!B44","v":0},{"$f":"Tecno!C44","v":0},{"$f":"B44*Componentes!$J$12+C44*Componentes!$J$13","v":0},{"$f":"IF(Tecno!E44<>\"\",Tecno!E44,\"\")","v":""},{"$f":"Tecno!F44","v":0},null,{"$f":"IF(Tecno!H44<>\"\",Tecno!H44,\"\")","v":""},{"$f":"Componentes!$J$28*C44","v":0},{"$f":"D44+G44+I44","v":0}]
["Demais Manutenções",null,null,null,null,null,null,null,null,{"$f":"SUM(J41:J44)+Componentes!$H$4","v":246.41}]
[]
["Controle formiga manutenção",{"$f":"Tecno!B47","v":1.4},{"$f":"Tecno!C47","v":0},{"$f":"B47*Componentes!$J$12+C47*Componentes!$J$13","v":19.949999999999996},{"$f":"IF(Tecno!E47<>\"\",Tecno!E47,\"\")","v":"Formicida granulado"},{"$f":"Tecno!F47","v":0.6},{"$f":"F47*Componentes!$E$55","v":26.46},{"$f":"IF(Tecno!H47<>\"\",Tecno!H47,\"\")","v":""},null,{"$f":"D47+G47+I47","v":46.41}]
["Patrolamento Aceiro",null,null,{"$f":"B48*Componentes!$J$12+C48*Componentes!$J$13","v":0},{"$f":"IF(Tecno!E48<>\"\",Tecno!E48,\"\")","v":""},{"$f":"Tecno!F48","v":0},null,null,{"$f":"Componentes!$J$28*C48","v":0},{"$f":"D48+G48+I48","v":0}]
[null,null,null,null,null,null,null,null,null,{"$f":"SUM(J47:J48)+Componentes!$H$4","v":246.41}]
["SEGUNDA ROTAÇÃO",null,null,"Volume aos 7 anos (m3):",134.25461858115005]
["Primeira Manutenção","Mão-de-Obra",null,null,"Insumo",null,null,"Máquinas"]
[null,"Braçal","Tratorista","Custo","Produto","Quantidade","Custo","Equipamento","Custo","Custo Total"]
["Controle Químico Linha ",{"$f":"Tecno!B53","v":6},{"$f":"Tecno!C53","v":0},{"$f":"B53*Componentes!$J$12+C53*Componentes!$J$13","v":85.499999999999986},{"$f":"IF(Tecno!E53<>\"\",Tecno!E53,\"\")","v":"Round up"},{"$f":"Tecno!F53","v":0.94},{"$f":"F53*Componentes!$E$56","v":63.778999999999989},{"$f":"IF(Tecno!H53<>\"\",Tecno!H53,\"\")","v":""},null,{"$f":"D53+G53+I53","v":149.27899999999997}]
["Controle Químico Entrelinha",null,null,{"$f":"B54*Componentes!$J$12+C54*Componentes!$J$13","v":0},null,null,{"$f":"F54*Componentes!$E$56","v":0},null,{"$f":"Componentes!$J$31*C54","v":0},{"$f":"D54+G54+I54","v":0}]
["Controle de formigas",{"$f":"Tecno!B55","v":1.8},{"$f":"Tecno!C55","v":0},{"$f":"B55*Componentes!$J$12+C55*Componentes!$J$13","v":25.65},{"$f":"IF(Tecno!E55<>\"\",Tecno!E55,\"\")","v":"Formicida granulado"},{"$f":"Tecno!F55","v":0.7},{"$f":"F55*Componentes!$E$55","v":30.869999999999997},{"$f":"IF(Tecno!H55<>\"\",Tecno!H55,\"\")","v":""},null,{"$f":"D55+G55+I55","v":56.519999999999996}]
["Adubação de Manutenção",{"$f":"Tecno!B56","v":0.1},{"$f":"Tecno!C56","v":0.42},{"$f":"B56*Componentes!$J$12+C56*Componentes!$J$13","v":5.5103242320819108},{"$f":"IF(Tecno!E56<>\"\",Tecno!E56,\"\")","v":"NPK-8:5:18 líquido"},250,{"$f":"F56*Componentes!$E$53/1000","v":250},{"$f":"IF(Tecno!H56<>\"\",Tecno!H56,\"\")","v":"Trator Médio + Tanque pulverizador com 2 mangueiras"},{"$f":"Componentes!$J$31*C56","v":18.453749999999999},{"$f":"D56+G56+I56","v":273.96407423208188}]
["Patrolamento Aceiro",{"$f":"Tecno!B57","v":0},{"$f":"Tecno!C57/2","v":0},{"$f":"B57*Componentes!$J$12+C57*Componentes!$J$13","v":0},{"$f":"IF(Tecno!E57<>\"\",Tecno!E57,\"\")","v":""},{"$f":"Tecno!F57","v":0},null,{"$f":"IF(Tecno!H57<>\"\",Tecno!H57,\"\")","v":""},{"$f":"Componentes!$J$28*C57","v":0},{"$f":"D57+G57+I57","v":0}]
["Segunda Manutenção",null,null,null,null,null,null,null,null,{"$f":"SUM(J53:J57)+Componentes!$H$4","v":679.76307423208186}]
[]
["Controle Químico Entrelinha",{"$f":"Tecno!B60","v":0},{"$f":"Tecno!C60","v":0},{"$f":"B60*Componentes!$J$12+C60*Componentes!$J$13","v":0},{"$f":"IF(Tecno!E60<>\"\",Tecno!E60,\"\")","v":""},{"$f":"Tecno!F60","v":0},{"$f":"F60*Componentes!$E$56","v":0},{"$f":"IF(Tecno!H60<>\"\",Tecno!H60,\"\")","v":""},{"$f":"Componentes!$J$31*C60","v":0},{"$f":"D60+G60+I60","v":0}]
["Fosfatagem",{"$f":"Tecno!B61","v":0.66},{"$f":"Tecno!C61","v":1.02},{"$f":"B61*Componentes!$J$12+C61*Componentes!$J$13","v":19.326501706484642},{"$f":"IF(Tecno!E61<>\"\",Tecno!E61,\"\")","v":"Superfosfato Simples"},250,{"$f":"Componentes!$E$50/1000*F61","v":205.97499999999999},{"$f":"IF(Tecno!H61<>\"\",Tecno!H61,\"\")","v":"MF 290 + Aplicador Adubo Granulado"},{"$f":"Componentes!$J$37*C61","v":73.121250000000003},{"$f":"D61+G61+I61","v":298.42275170648463}]
["Desbrota",{"$f":"Tecno!B62/2","v":6},{"$f":"Tecno!C62","v":0},{"$f":"B62*Componentes!$J$12+C62*Componentes!$J$13","v":85.499999999999986},{"$f":"IF(Tecno!E62<>\"\",Tecno!E62,\"\")","v":""},{"$f":"Tecno!F62","v":0},null,{"$f":"IF(Tecno!H62<>\"\",Tecno!H62,\"\")","v":"Motoroçadeira"},{"$f":"Componentes!J23*B62","v":21.3675},{"$f":"D62+G62+I62","v":106.86749999999998}]
["Roçada Manual Linha",{"$f":"Tecno!B63","v":4},{"$f":"Tecno!C63","v":0},{"$f":"B63*Componentes!$J$12+C63*Componentes!$J$13","v":56.999999999999993},{"$f":"IF(Tecno!E63<>\"\",Tecno!E63,\"\")","v":""},{"$f":"Tecno!F63","v":0},null,{"$f":"IF(Tecno!H63<>\"\",Tecno!H63,\"\")","v":""},null,{"$f":"D63+G63+I63","v":56.999999999999993}]
["Patrolamento Aceiro",{"$f":"Tecno!B64","v":0},{"$f":"Tecno!C64/2","v":0},{"$f":"B64*Componentes!$J$12+C64*Componentes!$J$13","v":0},{"$f":"IF(Tecno!E64<>\"\",Tecno!E64,\"\")","v":""},{"$f":"Tecno!F64","v":0},null,{"$f":"IF(Tecno!H64<>\"\",Tecno!H64,\"\")","v":""},{"$f":"Componentes!$J$28*C64","v":0},{"$f":"D64+G64+I64","v":0}]
["Terceira Manutenção",null,null,null,null,null,null,null,null,{"$f":"SUM(J60:J64)+Componentes!$H$4","v":662.29025170648458}]
[]
["Controle Químico Entrelinha",{"$f":"Tecno!B67","v":0},{"$f":"Tecno!C67","v":0},{"$f":"B67*Componentes!$J$12+C67*Componentes!$J$13","v":0},{"$f":"IF(Tecno!E67<>\"\",Tecno!E67,\"\")","v":""},{"$f":"Tecno!F67","v":0},{"$f":"F67*Componentes!$E$56","v":0},{"$f":"IF(Tecno!H67<>\"\",Tecno!H67,\"\")","v":""},{"$f":"Componentes!$J$31*C67","v":0},{"$f":"D67+G67+I67","v":0}]
["Adubação de Manutenção",{"$f":"Tecno!B68","v":0},{"$f":"Tecno!C68","v":0},{"$f":"B68*Componentes!$J$12+C68*Componentes!$J$13","v":0},{"$f":"IF(Tecno!E68<>\"\",Tecno!E68,\"\")","v":""},250,null,{"$f":"IF(Tecno!H68<>\"\",Tecno!H68,\"\")","v":""},{"$f":"Componentes!$J$31*C68","v":0},{"$f":"D68+G68+I68","v":0}]
["Controle formiga manutenção",{"$f":"Tecno!B69","v":1.4},{"$f":"Tecno!C69","v":0},{"$f":"B69*Componentes!$J$12+C69*Componentes!$J$13","v":19.949999999999996},{"$f":"IF(Tecno!E69<>\"\",Tecno!E69,\"\")","v":"Formicida granulado"},{"$f":"Tecno!F69","v":0.6},{"$f":"F69*Componentes!$E$55","v":26.46},{"$f":"IF(Tecno!H69<>\"\",Tecno!H69,\"\")","v":""},null,{"$f":"D69+G69+I69","v":46.41}]
["Patrolamento Aceiro",{"$f":"Tecno!B70","v":0},{"$f":"Tecno!C70/2","v":0},{"$f":"B70*Componentes!$J$12+C70*Componentes!$J$13","v":0},{"$f":"IF(Tecno!E70<>\"\",Tecno!E70,\"\")","v":""},{"$f":"Tecno!F70","v":0},null,{"$f":"IF(Tecno!H70<>\"\",Tecno!H70,\"\")","v":""},{"$f":"Componentes!$J$28*C70","v":0},{"$f":"D70+G70+I70","v":0}]
["Demais Manutenções",null,null,null,null,null,null,null,null,{"$f":"SUM(J67:J70)+Componentes!$H$4","v":246.41}]
[]
["Controle formiga manutenção",{"$f":"Tecno!B73","v":1.4},{"$f":"Tecno!C73","v":0},{"$f":"B73*Componentes!$J$12+C73*Componentes!$J$13","v":19.949999999999996},{"$f":"IF(Tecno!E73<>\"\",Tecno!E73,\"\")","v":"Formicida granulado"},{"$f":"Tecno!F73","v":0.6},{"$f":"F73*Componentes!$E$55","v":26.46},{"$f":"IF(Tecno!H73<>\"\",Tecno!H73,\"\")","v":""},null,{"$f":"D73+G73+I73","v":46.41}]
["Patrolamento Aceiro",null,null,{"$f":"B74*Componentes!$J$12+C74*Componentes!$J$13","v":0},{"$f":"IF(Tecno!E74<>\"\",Tecno!E74,\"\")","v":""},{"$f":"Tecno!F74","v":0},null,{"$f":"IF(Tecno!H74<>\"\",Tecno!H74,\"\")","v":""},{"$f":"Componentes!$J$28*C74","v":0},{"$f":"D74+G74+I74","v":0}]
[null,null,null,null,null,null,null,null,null,{"$f":"SUM(J73:J74)+Componentes!$H$4","v":246.41}]

{"sheet":"EucEne3Rot","index":8,"n_rows":101,"n_cols":10,"rows_kept":101,"cut":false,"hidden":false,"merged":[[7,0,8,0],[7,1,7,3],[7,4,7,6],[7,7,7,8],[24,0,25,0],[24,1,24,3],[24,4,24,6],[24,7,24,8],[0,0,0,6],[1,0,1,6],[2,0,2,6],[3,0,3,6],[4,0,4,6],[38,0,39,0],[38,1,38,3],[38,4,38,6],[38,7,38,8],[32,0,33,0],[32,1,32,3],[32,4,32,6],[32,7,32,8],[44,0,45,0],[44,1,44,3],[44,4,44,6],[44,7,44,8],[50,0,51,0],[50,1,50,3],[50,4,50,6],[50,7,50,8],[57,0,58,0],[57,1,57,3],[57,4,57,6],[57,7,57,8],[64,0,65,0],[64,1,64,3],[64,4,64,6],[64,7,64,8],[70,0,71,0],[70,1,70,3],[70,4,70,6],[70,7,70,8],[76,0,77,0],[76,1,76,3],[76,4,76,6],[76,7,76,8],[96,0,97,0],[96,1,96,3],[96,4,96,6],[96,7,96,8],[83,0,84,0],[83,1,83,3],[83,4,83,6],[83,7,83,8],[90,0,91,0],[90,1,90,3],[90,4,90,6],[90,7,90,8]]}
["Detalhamento dos Custos das Operações - Eucalipto p/ Energia - Ciclos c/ 3 Rotações"]
["(Rendimento técnico da MDO em homem-hora/hectare)"]
["(Para MDO, considerou-se apenas MDO tipo braçal e tratorista)"]
["(Rendimento técnico do equipamento em hora-máquina/hectare)"]
["(Custo total da operação em $/hectare)"]
[]
["PRIMEIRA ROTAÇÃO",null,null,"Volume aos 7 anos (m3):",149.77254683860372]
["Plantio","Mão-de-Obra",null,null,"Insumo",null,null,"Máquinas"]
[null,"Braçal","Tratorista","Custo","Produto","Quantidade","Custo","Equipamento","Custo","Custo Total"]
["Conservação do Solo",{"$f":"Tecno!B10/2","v":0},{"$f":"Tecno!C10/2","v":0},{"$f":"B10*Componentes!$J$12+C10*Componentes!$J$13","v":0},{"$f":"IF(Tecno!E10<>\"\",Tecno!E10,\"\")","v":""},{"$f":"Tecno!F10","v":0},null,{"$f":"IF(Tecno!H10<>\"\",Tecno!H10,\"\")","v":""},{"$f":"Componentes!J29*C10","v":0},{"$f":"D10+G10+I10","v":0}]
["Construção de Aceiros",{"$f":"Tecno!B11/2","v":0},{"$f":"Tecno!C11/2","v":0},{"$f":"B11*Componentes!$J$12+C11*Componentes!$J$13","v":0},{"$f":"IF(Tecno!E11<>\"\",Tecno!E11,\"\")","v":""},{"$f":"Tecno!F11","v":0},null,{"$f":"IF(Tecno!H11<>\"\",Tecno!H11,\"\")","v":""},{"$f":"Componentes!J29*C11","v":0},{"$f":"D11+G11+I11","v":0}]
["Calagem",{"$f":"Tecno!B12","v":1.2},{"$f":"Tecno!C12","v":1.2},{"$f":"B12*Componentes!$J$12+C12*Componentes!$J$13","v":28.772354948805457},{"$f":"IF(Tecno!E12<>\"\",Tecno!E12,\"\")","v":"Calcário dolomítico"},{"$f":"Tecno!F12","v":4},{"$f":"F12*Componentes!E47","v":340},{"$f":"IF(Tecno!H12<>\"\",Tecno!H12,\"\")","v":"MF 290 + Aplicador calcário"},{"$f":"Componentes!J36*C12","v":83.25},{"$f":"D12+G12+I12","v":452.02235494880546}]
["Combate a formiga 1",{"$f":"Tecno!B13","v":2.3199999999999998},{"$f":"Tecno!C13","v":0},{"$f":"B13*Componentes!$J$12+C13*Componentes!$J$13","v":33.059999999999995},{"$f":"IF(Tecno!E13<>\"\",Tecno!E13,\"\")","v":"Formicida granulado"},{"$f":"Tecno!F13","v":1.5},{"$f":"F13*Componentes!$E$55","v":66.150000000000006},{"$f":"IF(Tecno!H13<>\"\",Tecno!H13,\"\")","v":""},null,99.210000000000008]
["Combate a formiga 2",null,null,{"$f":"B14*Componentes!$J$12+C14*Componentes!$J$13","v":0},null,null,{"$f":"F14*Componentes!$E$55","v":0},{"$f":"IF(Tecno!H14<>\"\",Tecno!H14,\"\")","v":""},null,0]
["Combate a formiga 3",null,null,{"$f":"B15*Componentes!$J$12+C15*Componentes!$J$13","v":0},null,null,{"$f":"F15*Componentes!$E$55","v":0},{"$f":"IF(Tecno!H15<>\"\",Tecno!H15,\"\")","v":""},null,0]
["Controle Químico Mec. Total",{"$f":"Tecno!B16","v":0},{"$f":"Tecno!C16","v":0},{"$f":"B16*Componentes!$J$12+C16*Componentes!$J$13","v":0},{"$f":"IF(Tecno!E16<>\"\",Tecno!E16,\"\")","v":""},{"$f":"Tecno!F16","v":0},{"$f":"F16*Componentes!$E$56","v":0},{"$f":"IF(Tecno!H16<>\"\",Tecno!H16,\"\")","v":""},{"$f":"Componentes!$J$31*C16","v":0},0]
["Subsolagem",{"$f":"Tecno!B17","v":0},{"$f":"Tecno!C17","v":0},{"$f":"B17*Componentes!$J$12+C17*Componentes!$J$13","v":0},{"$f":"IF(Tecno!E17<>\"\",Tecno!E17,\"\")","v":""},{"$f":"Tecno!F17","v":0},null,{"$f":"IF(Tecno!H17<>\"\",Tecno!H17,\"\")","v":""},{"$f":"Componentes!J40*C17","v":0},0]
["Coveamento",{"$f":"Tecno!B18","v":16},{"$f":"Tecno!C18","v":0},{"$f":"B18*Componentes!$J$12+C18*Componentes!$J$13","v":227.99999999999997},{"$f":"IF(Tecno!E18<>\"\",Tecno!E18,\"\")","v":""},{"$f":"Tecno!F18","v":0},null,{"$f":"IF(Tecno!H18<>\"\",Tecno!H18,\"\")","v":""},null,227.99999999999997]
["Adubação",{"$f":"Tecno!B19","v":1.2},{"$f":"Tecno!C19","v":1.2},{"$f":"B19*Componentes!$J$12+C19*Componentes!$J$13","v":28.772354948805457},{"$f":"IF(Tecno!E19<>\"\",Tecno!E19,\"\")","v":"NPK-6:30:6"},{"$f":"Tecno!F19","v":200},{"$f":"F19*Componentes!$E$52/1000","v":200},{"$f":"IF(Tecno!H19<>\"\",Tecno!H19,\"\")","v":"MF 290 + Aplicador Adubo Granulado"},{"$f":"Componentes!J37*C19","v":86.024999999999991},314.79735494880543]
["Plantio",{"$f":"Tecno!B20","v":12},{"$f":"Tecno!C20","v":3},{"$f":"B20*Componentes!$J$12+C20*Componentes!$J$13","v":200.18088737201361},{"$f":"IF(Tecno!E20<>\"\",Tecno!E20,\"\")","v":"Mudas"},{"$f":"Tecno!F20","v":1667},{"$f":"F20*Componentes!E46/1000","v":583.45000000000005},{"$f":"IF(Tecno!H20<>\"\",Tecno!H20,\"\")","v":"Valmet 880 + carreta"},{"$f":"Componentes!J39*C20","v":155.39999999999998},{"$f":"D20+G20+I20","v":939.03088737201358}]
["Irrigação",{"$f":"Tecno!B21","v":0},{"$f":"Tecno!C21","v":0},{"$f":"B21*Componentes!$J$12+C21*Componentes!$J$13","v":0},{"$f":"IF(Tecno!E21<>\"\",Tecno!E21,\"\")","v":""},{"$f":"Tecno!F21","v":0},null,{"$f":"IF(Tecno!H21<>\"\",Tecno!H21,\"\")","v":""},{"$f":"1.31*Componentes!J31","v":57.558125000000004},{"$f":"D21+G21+I21","v":57.558125000000004}]
["Levantamento Sobrevivência",{"$f":"Tecno!B22","v":0},{"$f":"Tecno!C22","v":0},{"$f":"B22*Componentes!$J$12+C22*Componentes!$J$13","v":0},{"$f":"IF(Tecno!E22<>\"\",Tecno!E22,\"\")","v":""},{"$f":"Tecno!F22","v":0},null,{"$f":"IF(Tecno!H22<>\"\",Tecno!H22,\"\")","v":""}]
["Replantio",{"$f":"Tecno!B23","v":0},{"$f":"Tecno!C23","v":0},{"$f":"B23*Componentes!$J$12+C23*Componentes!$J$13","v":0},{"$f":"IF(Tecno!E23<>\"\",Tecno!E23,\"\")","v":""},{"$f":"Tecno!F23","v":0},null,{"$f":"IF(Tecno!H23<>\"\",Tecno!H23,\"\")","v":""},{"$f":"Componentes!J39*C23","v":0},{"$f":"D23+G23+I23","v":0}]
["Adubação cobertura",{"$f":"Tecno!B24","v":0},{"$f":"Tecno!C24","v":0},{"$f":"B24*Componentes!$J$12+C24*Componentes!$J$13","v":0},{"$f":"IF(Tecno!E24<>\"\",Tecno!E24,\"\")","v":""},{"$f":"Tecno!F24","v":0},{"$f":"F24*Componentes!E54/1000","v":0},{"$f":"IF(Tecno!H24<>\"\",Tecno!H24,\"\")","v":""},{"$f":"Componentes!J37*C24","v":0},{"$f":"D24+G24+I24","v":0}]
["Primeira Manutenção",null,null,null,null,null,null,null,null,{"$f":"SUM(J10:J24)+Componentes!$H$4","v":2290.6187222696244}]
[]
["Conservação do Solo",{"$f":"Tecno!B27/2","v":0},{"$f":"Tecno!C27/2","v":0},{"$f":"B27*Componentes!$J$12+C27*Componentes!$J$13","v":0},{"$f":"IF(Tecno!E27<>\"\",Tecno!E27,\"\")","v":""},{"$f":"Tecno!F27","v":0},null,{"$f":"IF(Tecno!H27<>\"\",Tecno!H27,\"\")","v":""},{"$f":"Componentes!$J$29*C27","v":0},{"$f":"D27+G27+I27","v":0}]
["Controle Químico Linha ",{"$f":"Tecno!B28","v":6},{"$f":"Tecno!C28","v":0},{"$f":"B28*Componentes!$J$12+C28*Componentes!$J$13","v":85.499999999999986},{"$f":"IF(Tecno!E28<>\"\",Tecno!E28,\"\")","v":"Round up"},{"$f":"Tecno!F28","v":0.94},{"$f":"F28*Componentes!$E$56","v":63.778999999999989},{"$f":"IF(Tecno!H28<>\"\",Tecno!H28,\"\")","v":"Pulverizador costal motorizado"},{"$f":"Componentes!J23*B28","v":21.3675},170.64649999999997]
["Controle Químico Entrelinha",null,null,{"$f":"B29*Componentes!$J$12+C29*Componentes!$J$13","v":0},null,null,{"$f":"F29*Componentes!$E$56","v":0},null,{"$f":"Componentes!$J$31*C29","v":0},0]
["Controle de formigas",{"$f":"Tecno!B30","v":1.8},{"$f":"Tecno!C30","v":0},{"$f":"B30*Componentes!$J$12+C30*Componentes!$J$13","v":25.65},{"$f":"IF(Tecno!E30<>\"\",Tecno!E30,\"\")","v":"Formicida granulado"},{"$f":"Tecno!F30","v":0.7},{"$f":"F30*Componentes!$E$55","v":30.869999999999997},{"$f":"IF(Tecno!H30<>\"\",Tecno!H30,\"\")","v":"Caminhão + Carreta 4 ton."},null,56.519999999999996]
["Adubação de reforço manual",{"$f":"Tecno!B31","v":11.63},{"$f":"Tecno!C31","v":0.94},{"$f":"B31*Componentes!$J$12+C31*Componentes!$J$13","v":174.8708447098976},{"$f":"IF(Tecno!E31<>\"\",Tecno!E31,\"\")","v":"NPK-6:30:6"},{"$f":"Tecno!F31","v":200},{"$f":"F31*Componentes!$E$52/1000","v":200},{"$f":"IF(Tecno!H31<>\"\",Tecno!H31,\"\")","v":""},null,374.8708447098976]
["Manutenção de Aceiros",{"$f":"Tecno!B32/2","v":0},{"$f":"Tecno!C32/2","v":0},{"$f":"B32*Componentes!$J$12+C32*Componentes!$J$13","v":0},{"$f":"IF(Tecno!E32<>\"\",Tecno!E32,\"\")","v":""},{"$f":"Tecno!F32","v":0},null,{"$f":"IF(Tecno!H32<>\"\",Tecno!H32,\"\")","v":""},{"$f":"Componentes!$J$29*C32","v":0},0]
["Segunda Manutenção",null,null,null,null,null,null,null,null,{"$f":"SUM(J27:J32)+Componentes!$H$4","v":802.03734470989752}]
[]
["Controle Químico Entrelinha",{"$f":"Tecno!B35","v":0},{"$f":"Tecno!C35","v":0},{"$f":"B35*Componentes!$J$12+C35*Componentes!$J$13","v":0},{"$f":"IF(Tecno!E35<>\"\",Tecno!E35,\"\")","v":""},{"$f":"Tecno!F35","v":0},{"$f":"F35*Componentes!$E$56","v":0},{"$f":"IF(Tecno!H35<>\"\",Tecno!H35,\"\")","v":""},{"$f":"Componentes!$J$31*C35","v":0},{"$f":"D35+G35+I35","v":0}]
["Fosfatagem",null,null,{"$f":"B36*Componentes!$J$12+C36*Componentes!$J$13","v":0},null,null,{"$f":"F36*Componentes!$E$50/1000","v":0},null,{"$f":"Componentes!$J$37*C36","v":0},{"$f":"D36+G36+I36","v":0}]
["Roçada Manual Linha",{"$f":"Tecno!B37","v":8},{"$f":"Tecno!C37","v":0},{"$f":"B37*Componentes!$J$12+C37*Componentes!$J$13","v":113.99999999999999},{"$f":"IF(Tecno!E37<>\"\",Tecno!E37,\"\")","v":""},{"$f":"Tecno!F37","v":0},null,{"$f":"IF(Tecno!H37<>\"\",Tecno!H37,\"\")","v":""},null,{"$f":"D37+G37+I37","v":113.99999999999999}]
["Patrolamento Aceiro",{"$f":"Tecno!B38","v":0},{"$f":"Tecno!C38","v":0},{"$f":"B38*Componentes!$J$12+C38*Componentes!$J$13","v":0},{"$f":"IF(Tecno!E38<>\"\",Tecno!E38,\"\")","v":""},{"$f":"Tecno!F38","v":0},null,{"$f":"IF(Tecno!H38<>\"\",Tecno!H38,\"\")","v":""},{"$f":"Componentes!$J$28*C38","v":0},{"$f":"D38+G38+I38","v":0}]
["Terceira Manutenção",null,null,null,null,null,null,null,null,{"$f":"SUM(J35:J38)+Componentes!$H$4","v":314}]
[]
["Controle Químico Entrelinha",{"$f":"Tecno!B41","v":0},{"$f":"Tecno!C41","v":0},{"$f":"B41*Componentes!$J$12+C41*Componentes!$J$13","v":0},{"$f":"IF(Tecno!E41<>\"\",Tecno!E41,\"\")","v":""},{"$f":"Tecno!F41","v":0},{"$f":"F41*Componentes!$E$56","v":0},{"$f":"IF(Tecno!H41<>\"\",Tecno!H41,\"\")","v":""},{"$f":"Componentes!$J$31*C41","v":0},{"$f":"D41+G41+I41","v":0}]
["Adubação de Manutenção",null,null,{"$f":"B42*Componentes!$J$12+C42*Componentes!$J$13","v":0},null,null,{"$f":"F42*Componentes!$E$53/1000","v":0},null,{"$f":"Componentes!$J$31*C42","v":0},{"$f":"D42+G42+I42","v":0}]
["Controle formiga manutenção",{"$f":"Tecno!B43","v":1.4},{"$f":"Tecno!C43","v":0},{"$f":"B43*Componentes!$J$12+C43*Componentes!$J$13","v":19.949999999999996},{"$f":"IF(Tecno!E43<>\"\",Tecno!E43,\"\")","v":"Formicida granulado"},{"$f":"Tecno!F43","v":0.6},{"$f":"F43*Componentes!$E$55","v":26.46},{"$f":"IF(Tecno!H43<>\"\",Tecno!H43,\"\")","v":""},null,{"$f":"D43+G43+I43","v":46.41}]
["Patrolamento Aceiro",{"$f":"Tecno!B44","v":0},{"$f":"Tecno!C44","v":0},{"$f":"B44*Componentes!$J$12+C44*Componentes!$J$13","v":0},{"$f":"IF(Tecno!E44<>\"\",Tecno!E44,\"\")","v":""},{"$f":"Tecno!F44","v":0},null,{"$f":"IF(Tecno!H44<>\"\",Tecno!H44,\"\")","v":""},{"$f":"Componentes!$J$28*C44","v":0},{"$f":"D44+G44+I44","v":0}]
["Demais Manutenções",null,null,null,null,null,null,null,null,{"$f":"SUM(J41:J44)+Componentes!$H$4","v":246.41}]
[]
["Controle formiga manutenção",{"$f":"Tecno!B47","v":1.4},{"$f":"Tecno!C47","v":0},{"$f":"B47*Componentes!$J$12+C47*Componentes!$J$13","v":19.949999999999996},{"$f":"IF(Tecno!E47<>\"\",Tecno!E47,\"\")","v":"Formicida granulado"},{"$f":"Tecno!F47","v":0.6},{"$f":"F47*Componentes!$E$55","v":26.46},{"$f":"IF(Tecno!H47<>\"\",Tecno!H47,\"\")","v":""},null,{"$f":"D47+G47+I47","v":46.41}]
["Patrolamento Aceiro",null,null,{"$f":"B48*Componentes!$J$12+C48*Componentes!$J$13","v":0},{"$f":"IF(Tecno!E48<>\"\",Tecno!E48,\"\")","v":""},{"$f":"Tecno!F48","v":0},null,null,{"$f":"Componentes!$J$28*C48","v":0},{"$f":"D48+G48+I48","v":0}]
[null,null,null,null,null,null,null,null,null,{"$f":"SUM(J47:J48)+Componentes!$H$4","v":246.41}]
["SEGUNDA ROTAÇÃO",null,null,"Volume aos 7 anos (m3):",134.25461858115005]
["Primeira Manutenção","Mão-de-Obra",null,null,"Insumo",null,null,"Máquinas"]
[null,"Braçal","Tratorista","Custo","Produto","Quantidade","Custo","Equipamento","Custo","Custo Total"]
["Controle Químico Linha ",{"$f":"Tecno!B53","v":6},{"$f":"Tecno!C53","v":0},{"$f":"B53*Componentes!$J$12+C53*Componentes!$J$13","v":85.499999999999986},{"$f":"IF(Tecno!E53<>\"\",Tecno!E53,\"\")","v":"Round up"},{"$f":"Tecno!F53","v":0.94},{"$f":"F53*Componentes!$E$56","v":63.778999999999989},{"$f":"IF(Tecno!H53<>\"\",Tecno!H53,\"\")","v":""},null,{"$f":"D53+G53+I53","v":149.27899999999997}]
["Controle Químico Entrelinha",null,null,{"$f":"B54*Componentes!$J$12+C54*Componentes!$J$13","v":0},null,null,{"$f":"F54*Componentes!$E$56","v":0},null,{"$f":"Componentes!$J$31*C54","v":0},{"$f":"D54+G54+I54","v":0}]
["Controle de formigas",{"$f":"Tecno!B55","v":1.8},{"$f":"Tecno!C55","v":0},{"$f":"B55*Componentes!$J$12+C55*Componentes!$J$13","v":25.65},{"$f":"IF(Tecno!E55<>\"\",Tecno!E55,\"\")","v":"Formicida granulado"},{"$f":"Tecno!F55","v":0.7},{"$f":"F55*Componentes!$E$55","v":30.869999999999997},{"$f":"IF(Tecno!H55<>\"\",Tecno!H55,\"\")","v":""},null,{"$f":"D55+G55+I55","v":56.519999999999996}]
["Adubação de Manutenção",{"$f":"Tecno!B56","v":0.1},{"$f":"Tecno!C56","v":0.42},{"$f":"B56*Componentes!$J$12+C56*Componentes!$J$13","v":5.5103242320819108},{"$f":"IF(Tecno!E56<>\"\",Tecno!E56,\"\")","v":"NPK-8:5:18 líquido"},250,{"$f":"F56*Componentes!$E$53/1000","v":250},{"$f":"IF(Tecno!H56<>\"\",Tecno!H56,\"\")","v":"Trator Médio + Tanque pulverizador com 2 mangueiras"},{"$f":"Componentes!$J$31*C56","v":18.453749999999999},{"$f":"D56+G56+I56","v":273.96407423208188}]
["Patrolamento Aceiro",{"$f":"Tecno!B57","v":0},{"$f":"Tecno!C57/2","v":0},{"$f":"B57*Componentes!$J$12+C57*Componentes!$J$13","v":0},{"$f":"IF(Tecno!E57<>\"\",Tecno!E57,\"\")","v":""},{"$f":"Tecno!F57","v":0},null,{"$f":"IF(Tecno!H57<>\"\",Tecno!H57,\"\")","v":""},{"$f":"Componentes!$J$28*C57","v":0},{"$f":"D57+G57+I57","v":0}]
["Segunda Manutenção",null,null,null,null,null,null,null,null,{"$f":"SUM(J53:J57)+Componentes!$H$4","v":679.76307423208186}]
[]
["Controle Químico Entrelinha",{"$f":"Tecno!B60","v":0},{"$f":"Tecno!C60","v":0},{"$f":"B60*Componentes!$J$12+C60*Componentes!$J$13","v":0},{"$f":"IF(Tecno!E60<>\"\",Tecno!E60,\"\")","v":""},{"$f":"Tecno!F60","v":0},{"$f":"F60*Componentes!$E$56","v":0},{"$f":"IF(Tecno!H60<>\"\",Tecno!H60,\"\")","v":""},{"$f":"Componentes!$J$31*C60","v":0},{"$f":"D60+G60+I60","v":0}]
["Fosfatagem",{"$f":"Tecno!B61","v":0.66},{"$f":"Tecno!C61","v":1.02},{"$f":"B61*Componentes!$J$12+C61*Componentes!$J$13","v":19.326501706484642},{"$f":"IF(Tecno!E61<>\"\",Tecno!E61,\"\")","v":"Superfosfato Simples"},250,{"$f":"Componentes!$E$50/1000*F61","v":205.97499999999999},{"$f":"IF(Tecno!H61<>\"\",Tecno!H61,\"\")","v":"MF 290 + Aplicador Adubo Granulado"},{"$f":"Componentes!$J$37*C61","v":73.121250000000003},{"$f":"D61+G61+I61","v":298.42275170648463}]
["Desbrota",{"$f":"Tecno!B62/2","v":6},{"$f":"Tecno!C62","v":0},{"$f":"B62*Componentes!$J$12+C62*Componentes!$J$13","v":85.499999999999986},{"$f":"IF(Tecno!E62<>\"\",Tecno!E62,\"\")","v":""},{"$f":"Tecno!F62","v":0},null,{"$f":"IF(Tecno!H62<>\"\",Tecno!H62,\"\")","v":"Motoroçadeira"},{"$f":"Componentes!J23*B62","v":21.3675},{"$f":"D62+G62+I62","v":106.86749999999998}]
["Roçada Manual Linha",{"$f":"Tecno!B63","v":4},{"$f":"Tecno!C63","v":0},{"$f":"B63*Componentes!$J$12+C63*Componentes!$J$13","v":56.999999999999993},{"$f":"IF(Tecno!E63<>\"\",Tecno!E63,\"\")","v":""},{"$f":"Tecno!F63","v":0},null,{"$f":"IF(Tecno!H63<>\"\",Tecno!H63,\"\")","v":""},null,{"$f":"D63+G63+I63","v":56.999999999999993}]
["Patrolamento Aceiro",{"$f":"Tecno!B64","v":0},{"$f":"Tecno!C64/2","v":0},{"$f":"B64*Componentes!$J$12+C64*Componentes!$J$13","v":0},{"$f":"IF(Tecno!E64<>\"\",Tecno!E64,\"\")","v":""},{"$f":"Tecno!F64","v":0},null,{"$f":"IF(Tecno!H64<>\"\",Tecno!H64,\"\")","v":""},{"$f":"Componentes!$J$28*C64","v":0},{"$f":"D64+G64+I64","v":0}]
["Terceira Manutenção",null,null,null,null,null,null,null,null,{"$f":"SUM(J60:J64)+Componentes!$H$4","v":662.29025170648458}]
[]
["Controle Químico Entrelinha",{"$f":"Tecno!B67","v":0},{"$f":"Tecno!C67","v":0},{"$f":"B67*Componentes!$J$12+C67*Componentes!$J$13","v":0},{"$f":"IF(Tecno!E67<>\"\",Tecno!E67,\"\")","v":""},{"$f":"Tecno!F67","v":0},{"$f":"F67*Componentes!$E$56","v":0},{"$f":"IF(Tecno!H67<>\"\",Tecno!H67,\"\")","v":""},{"$f":"Componentes!$J$31*C67","v":0},{"$f":"D67+G67+I67","v":0}]
["Adubação de Manutenção",{"$f":"Tecno!B68","v":0},{"$f":"Tecno!C68","v":0},{"$f":"B68*Componentes!$J$12+C68*Componentes!$J$13","v":0},{"$f":"IF(Tecno!E68<>\"\",Tecno!E68,\"\")","v":""},250,null,{"$f":"IF(Tecno!H68<>\"\",Tecno!H68,\"\")","v":""},{"$f":"Componentes!$J$31*C68","v":0},{"$f":"D68+G68+I68","v":0}]
["Controle formiga manutenção",{"$f":"Tecno!B69","v":1.4},{"$f":"Tecno!C69","v":0},{"$f":"B69*Componentes!$J$12+C69*Componentes!$J$13","v":19.949999999999996},{"$f":"IF(Tecno!E69<>\"\",Tecno!E69,\"\")","v":"Formicida granulado"},{"$f":"Tecno!F69","v":0.6},{"$f":"F69*Componentes!$E$55","v":26.46},{"$f":"IF(Tecno!H69<>\"\",Tecno!H69,\"\")","v":""},null,{"$f":"D69+G69+I69","v":46.41}]
["Patrolamento Aceiro",{"$f":"Tecno!B70","v":0},{"$f":"Tecno!C70/2","v":0},{"$f":"B70*Componentes!$J$12+C70*Componentes!$J$13","v":0},{"$f":"IF(Tecno!E70<>\"\",Tecno!E70,\"\")","v":""},{"$f":"Tecno!F70","v":0},null,{"$f":"IF(Tecno!H70<>\"\",Tecno!H70,\"\")","v":""},{"$f":"Componentes!$J$28*C70","v":0},{"$f":"D70+G70+I70","v":0}]
["Demais Manutenções",null,null,null,null,null,null,null,null,{"$f":"SUM(J67:J70)+Componentes!$H$4","v":246.41}]
[]
["Controle formiga manutenção",{"$f":"Tecno!B73","v":1.4},{"$f":"Tecno!C73","v":0},{"$f":"B73*Componentes!$J$12+C73*Componentes!$J$13","v":19.949999999999996},{"$f":"IF(Tecno!E73<>\"\",Tecno!E73,\"\")","v":"Formicida granulado"},{"$f":"Tecno!F73","v":0.6},{"$f":"F73*Componentes!$E$55","v":26.46},{"$f":"IF(Tecno!H73<>\"\",Tecno!H73,\"\")","v":""},null,{"$f":"D73+G73+I73","v":46.41}]
["Patrolamento Aceiro",null,null,{"$f":"B74*Componentes!$J$12+C74*Componentes!$J$13","v":0},{"$f":"IF(Tecno!E74<>\"\",Tecno!E74,\"\")","v":""},{"$f":"Tecno!F74","v":0},null,{"$f":"IF(Tecno!H74<>\"\",Tecno!H74,\"\")","v":""},{"$f":"Componentes!$J$28*C74","v":0},{"$f":"D74+G74+I74","v":0}]
[null,null,null,null,null,null,null,null,null,{"$f":"SUM(J73:J74)+Componentes!$H$4","v":246.41}]
["TERCEIRA ROTAÇÃO",null,null,"Volume aos 7 anos (m3):",120.34450231919497]
["Primeira Manutenção","Mão-de-Obra",null,null,"Insumo",null,null,"Máquinas"]
[null,"Braçal","Tratorista","Custo","Produto","Quantidade","Custo","Equipamento","Custo","Custo Total"]
["Controle Químico Linha ",{"$f":"Tecno!B79","v":6},{"$f":"Tecno!C79","v":0},{"$f":"B79*Componentes!$J$12+C79*Componentes!$J$13","v":85.499999999999986},{"$f":"IF(Tecno!E79<>\"\",Tecno!E79,\"\")","v":"Round up"},{"$f":"Tecno!F79","v":0.94},{"$f":"F79*Componentes!$E$56","v":63.778999999999989},{"$f":"IF(Tecno!H79<>\"\",Tecno!H79,\"\")","v":""},null,{"$f":"D79+G79+I79","v":149.27899999999997}]
["Controle Químico Entrelinha",null,null,{"$f":"B80*Componentes!$J$12+C80*Componentes!$J$13","v":0},null,null,{"$f":"F80*Componentes!$E$56","v":0},null,{"$f":"Componentes!$J$31*C80","v":0},{"$f":"D80+G80+I80","v":0}]
["Controle de formigas",{"$f":"Tecno!B81","v":1.8},{"$f":"Tecno!C81","v":0},{"$f":"B81*Componentes!$J$12+C81*Componentes!$J$13","v":25.65},{"$f":"IF(Tecno!E81<>\"\",Tecno!E81,\"\")","v":"Formicida granulado"},{"$f":"Tecno!F81","v":0.7},{"$f":"F81*Componentes!$E$55","v":30.869999999999997},{"$f":"IF(Tecno!H81<>\"\",Tecno!H81,\"\")","v":""},null,{"$f":"D81+G81+I81","v":56.519999999999996}]
["Adubação de Manutenção",{"$f":"Tecno!B82","v":0.1},{"$f":"Tecno!C82","v":0.42},{"$f":"B82*Componentes!$J$12+C82*Componentes!$J$13","v":5.5103242320819108},{"$f":"IF(Tecno!E82<>\"\",Tecno!E82,\"\")","v":"NPK-8:5:18 líquido"},250,{"$f":"F82*Componentes!$E$53/1000","v":250},{"$f":"IF(Tecno!H82<>\"\",Tecno!H82,\"\")","v":"Trator Médio + Tanque pulverizador com 2 mangueiras"},{"$f":"Componentes!$J$31*C82","v":18.453749999999999},{"$f":"D82+G82+I82","v":273.96407423208188}]
["Patrolamento Aceiro",{"$f":"Tecno!B83","v":0},{"$f":"Tecno!C83/2","v":0},{"$f":"B83*Componentes!$J$12+C83*Componentes!$J$13","v":0},{"$f":"IF(Tecno!E83<>\"\",Tecno!E83,\"\")","v":""},{"$f":"Tecno!F83","v":0},null,{"$f":"IF(Tecno!H83<>\"\",Tecno!H83,\"\")","v":""},{"$f":"Componentes!$J$28*C83","v":0},{"$f":"D83+G83+I83","v":0}]
["Segunda Manutenção",null,null,null,null,null,null,null,null,{"$f":"SUM(J79:J83)+Componentes!$H$4","v":679.76307423208186}]
[]
["Controle Químico Entrelinha",{"$f":"Tecno!B86","v":0},{"$f":"Tecno!C86","v":0},{"$f":"B86*Componentes!$J$12+C86*Componentes!$J$13","v":0},{"$f":"IF(Tecno!E86<>\"\",Tecno!E86,\"\")","v":""},{"$f":"Tecno!F86","v":0},{"$f":"F86*Componentes!$E$56","v":0},{"$f":"IF(Tecno!H86<>\"\",Tecno!H86,\"\")","v":""},{"$f":"Componentes!$J$31*C86","v":0},{"$f":"D86+G86+I86","v":0}]
["Fosfatagem",{"$f":"Tecno!B87","v":0.66},{"$f":"Tecno!C87","v":1.02},{"$f":"B87*Componentes!$J$12+C87*Componentes!$J$13","v":19.326501706484642},{"$f":"IF(Tecno!E87<>\"\",Tecno!E87,\"\")","v":"Superfosfato Simples"},250,{"$f":"Componentes!$E$50/1000*F87","v":205.97499999999999},{"$f":"IF(Tecno!H87<>\"\",Tecno!H87,\"\")","v":"MF 290 + Aplicador Adubo Granulado"},{"$f":"Componentes!$J$37*C87","v":73.121250000000003},{"$f":"D87+G87+I87","v":298.42275170648463}]
["Desbrota",{"$f":"Tecno!B88/2","v":6},{"$f":"Tecno!C88","v":0},{"$f":"B88*Componentes!$J$12+C88*Componentes!$J$13","v":85.499999999999986},{"$f":"IF(Tecno!E88<>\"\",Tecno!E88,\"\")","v":""},{"$f":"Tecno!F88","v":0},null,{"$f":"IF(Tecno!H88<>\"\",Tecno!H88,\"\")","v":"Motoroçadeira"},{"$f":"Componentes!J23*B88","v":21.3675},{"$f":"D88+G88+I88","v":106.86749999999998}]
["Roçada Manual Linha",{"$f":"Tecno!B89","v":4},{"$f":"Tecno!C89","v":0},{"$f":"B89*Componentes!$J$12+C89*Componentes!$J$13","v":56.999999999999993},{"$f":"IF(Tecno!E89<>\"\",Tecno!E89,\"\")","v":""},{"$f":"Tecno!F89","v":0},null,{"$f":"IF(Tecno!H89<>\"\",Tecno!H89,\"\")","v":""},null,{"$f":"D89+G89+I89","v":56.999999999999993}]
["Patrolamento Aceiro",{"$f":"Tecno!B90","v":0},{"$f":"Tecno!C90/2","v":0},{"$f":"B90*Componentes!$J$12+C90*Componentes!$J$13","v":0},{"$f":"IF(Tecno!E90<>\"\",Tecno!E90,\"\")","v":""},{"$f":"Tecno!F90","v":0},null,{"$f":"IF(Tecno!H90<>\"\",Tecno!H90,\"\")","v":""},{"$f":"Componentes!$J$28*C90","v":0},{"$f":"D90+G90+I90","v":0}]
["Terceira Manutenção",null,null,null,null,null,null,null,null,{"$f":"SUM(J86:J90)+Componentes!$H$4","v":662.29025170648458}]
[]
["Controle Químico Entrelinha",{"$f":"Tecno!B93","v":0},{"$f":"Tecno!C93","v":0},{"$f":"B93*Componentes!$J$12+C93*Componentes!$J$13","v":0},{"$f":"IF(Tecno!E93<>\"\",Tecno!E93,\"\")","v":""},{"$f":"Tecno!F93","v":0},{"$f":"F93*Componentes!$E$56","v":0},{"$f":"IF(Tecno!H93<>\"\",Tecno!H93,\"\")","v":""},{"$f":"Componentes!$J$31*C93","v":0},{"$f":"D93+G93+I93","v":0}]
["Adubação de Manutenção",{"$f":"Tecno!B94","v":0},{"$f":"Tecno!C94","v":0},{"$f":"B94*Componentes!$J$12+C94*Componentes!$J$13","v":0},{"$f":"IF(Tecno!E94<>\"\",Tecno!E94,\"\")","v":""},250,null,{"$f":"IF(Tecno!H94<>\"\",Tecno!H94,\"\")","v":""},{"$f":"Componentes!$J$31*C94","v":0},{"$f":"D94+G94+I94","v":0}]
["Controle formiga manutenção",{"$f":"Tecno!B95","v":1.4},{"$f":"Tecno!C95","v":0},{"$f":"B95*Componentes!$J$12+C95*Componentes!$J$13","v":19.949999999999996},{"$f":"IF(Tecno!E95<>\"\",Tecno!E95,\"\")","v":"Formicida granulado"},{"$f":"Tecno!F95","v":0.6},{"$f":"F95*Componentes!$E$55","v":26.46},{"$f":"IF(Tecno!H95<>\"\",Tecno!H95,\"\")","v":""},null,{"$f":"D95+G95+I95","v":46.41}]
["Patrolamento Aceiro",{"$f":"Tecno!B96","v":0},{"$f":"Tecno!C96/2","v":0},{"$f":"B96*Componentes!$J$12+C96*Componentes!$J$13","v":0},{"$f":"IF(Tecno!E96<>\"\",Tecno!E96,\"\")","v":""},{"$f":"Tecno!F96","v":0},null,{"$f":"IF(Tecno!H96<>\"\",Tecno!H96,\"\")","v":""},{"$f":"Componentes!$J$28*C96","v":0},{"$f":"D96+G96+I96","v":0}]
["Demais Manutenções",null,null,null,null,null,null,null,null,{"$f":"SUM(J93:J96)+Componentes!$H$4","v":246.41}]
[]
["Controle formiga manutenção",{"$f":"Tecno!B99","v":1.4},{"$f":"Tecno!C99","v":0},{"$f":"B99*Componentes!$J$12+C99*Componentes!$J$13","v":19.949999999999996},{"$f":"IF(Tecno!E99<>\"\",Tecno!E99,\"\")","v":"Formicida granulado"},{"$f":"Tecno!F99","v":0.6},{"$f":"F99*Componentes!$E$55","v":26.46},{"$f":"IF(Tecno!H99<>\"\",Tecno!H99,\"\")","v":""},null,{"$f":"D99+G99+I99","v":46.41}]
["Patrolamento Aceiro",null,null,{"$f":"B100*Componentes!$J$12+C100*Componentes!$J$13","v":0},{"$f":"IF(Tecno!E100<>\"\",Tecno!E100,\"\")","v":""},{"$f":"Tecno!F100","v":0},null,{"$f":"IF(Tecno!H100<>\"\",Tecno!H100,\"\")","v":""},{"$f":"Componentes!$J$28*C100","v":0},{"$f":"D100+G100+I100","v":0}]
[null,null,null,null,null,null,null,null,null,{"$f":"SUM(J99:J100)+Componentes!$H$4","v":246.41}]

{"sheet":"EucMadSol","index":9,"n_rows":63,"n_cols":10,"rows_kept":63,"cut":false,"hidden":false,"merged":[[7,0,8,0],[7,1,7,3],[7,4,7,6],[7,7,7,8],[24,0,25,0],[24,1,24,3],[24,4,24,6],[24,7,24,8],[0,0,0,6],[1,0,1,6],[2,0,2,6],[3,0,3,6],[4,0,4,6],[38,0,39,0],[38,1,38,3],[38,4,38,6],[38,7,38,8],[32,0,33,0],[32,1,32,3],[32,4,32,6],[32,7,32,8],[44,0,45,0],[44,1,44,3],[44,4,44,6],[44,7,44,8],[59,0,60,0],[59,1,59,3],[59,4,59,6],[59,7,59,8],[49,0,50,0],[49,1,49,3],[49,4,49,6],[49,7,49,8],[54,0,55,0],[54,1,54,3],[54,4,54,6],[54,7,54,8]]}
["Detalhamento dos Custos das Operações - Eucalipto p/ Madeira Sólida"]
["(Rendimento técnico da MDO em homem-hora/hectare)"]
["(Para MDO, considerou-se apenas MDO tipo braçal e tratorista)"]
["(Rendimento técnico do equipamento em hora-máquina/hectare)"]
["(Custo total da operação em $/hectare)"]
[]
["PRIMEIRA ROTAÇÃO"]
["Plantio","Mão-de-Obra",null,null,"Insumo",null,null,"Máquinas"]
[null,"Braçal","Tratorista","Custo","Produto","Quantidade","Custo","Equipamento","Custo","Custo Total"]
["Conservação do Solo",{"$f":"Tecno!B10","v":0},{"$f":"Tecno!C10","v":0},{"$f":"B10*Componentes!$J$12+C10*Componentes!$J$13","v":0},{"$f":"IF(Tecno!E10<>\"\",Tecno!E10,\"\")","v":""},{"$f":"Tecno!F10","v":0},null,{"$f":"IF(Tecno!H10<>\"\",Tecno!H10,\"\")","v":""},{"$f":"Componentes!J29*C10","v":0},{"$f":"D10+G10+I10","v":0}]
["Construção de Aceiros",{"$f":"Tecno!B11","v":0},{"$f":"Tecno!C11","v":0},{"$f":"B11*Componentes!$J$12+C11*Componentes!$J$13","v":0},{"$f":"IF(Tecno!E11<>\"\",Tecno!E11,\"\")","v":""},{"$f":"Tecno!F11","v":0},null,{"$f":"IF(Tecno!H11<>\"\",Tecno!H11,\"\")","v":""},{"$f":"Componentes!J29*C11","v":0},{"$f":"D11+G11+I11","v":0}]
["Calagem",{"$f":"Tecno!B12","v":1.2},{"$f":"Tecno!C12","v":1.2},{"$f":"B12*Componentes!$J$12+C12*Componentes!$J$13","v":28.772354948805457},{"$f":"IF(Tecno!E12<>\"\",Tecno!E12,\"\")","v":"Calcário dolomítico"},{"$f":"Tecno!F12","v":4},{"$f":"F12*Componentes!E47","v":340},{"$f":"IF(Tecno!H12<>\"\",Tecno!H12,\"\")","v":"MF 290 + Aplicador calcário"},{"$f":"Componentes!J36*C12","v":83.25},{"$f":"D12+G12+I12","v":452.02235494880546}]
["Combate a formiga 1",{"$f":"Tecno!B13","v":2.3199999999999998},{"$f":"Tecno!C13","v":0},{"$f":"B13*Componentes!$J$12+C13*Componentes!$J$13","v":33.059999999999995},{"$f":"IF(Tecno!E13<>\"\",Tecno!E13,\"\")","v":"Formicida granulado"},{"$f":"Tecno!F13","v":1.5},{"$f":"F13*Componentes!$E$55","v":66.150000000000006},{"$f":"IF(Tecno!H13<>\"\",Tecno!H13,\"\")","v":""},null,99.210000000000008]
["Combate a formiga 2",{"$f":"Tecno!B14","v":0},{"$f":"Tecno!C14","v":0},{"$f":"B14*Componentes!$J$12+C14*Componentes!$J$13","v":0},{"$f":"IF(Tecno!E14<>\"\",Tecno!E14,\"\")","v":""},{"$f":"Tecno!F14","v":0},{"$f":"F14*Componentes!$E$55","v":0},{"$f":"IF(Tecno!H14<>\"\",Tecno!H14,\"\")","v":""},null,0]
["Combate a formiga 3",{"$f":"Tecno!B15","v":0},{"$f":"Tecno!C15","v":0},{"$f":"B15*Componentes!$J$12+C15*Componentes!$J$13","v":0},{"$f":"IF(Tecno!E15<>\"\",Tecno!E15,\"\")","v":""},{"$f":"Tecno!F15","v":0},{"$f":"F15*Componentes!$E$55","v":0},{"$f":"IF(Tecno!H15<>\"\",Tecno!H15,\"\")","v":""},null,0]
["Controle Químico Mec. Total",{"$f":"Tecno!B16","v":0},{"$f":"Tecno!C16","v":0},{"$f":"B16*Componentes!$J$12+C16*Componentes!$J$13","v":0},{"$f":"IF(Tecno!E16<>\"\",Tecno!E16,\"\")","v":""},{"$f":"Tecno!F16","v":0},{"$f":"F16*Componentes!$E$56","v":0},{"$f":"IF(Tecno!H16<>\"\",Tecno!H16,\"\")","v":""},{"$f":"Componentes!$J$31*C16","v":0},0]
["Subsolagem",{"$f":"Tecno!B17","v":0},{"$f":"Tecno!C17","v":0},{"$f":"B17*Componentes!$J$12+C17*Componentes!$J$13","v":0},{"$f":"IF(Tecno!E17<>\"\",Tecno!E17,\"\")","v":""},{"$f":"Tecno!F17","v":0},null,{"$f":"IF(Tecno!H17<>\"\",Tecno!H17,\"\")","v":""},{"$f":"Componentes!J40*C17","v":0},0]
["Coveamento",{"$f":"Tecno!B18","v":16},{"$f":"Tecno!C18","v":0},{"$f":"B18*Componentes!$J$12+C18*Componentes!$J$13","v":227.99999999999997},{"$f":"IF(Tecno!E18<>\"\",Tecno!E18,\"\")","v":""},{"$f":"Tecno!F18","v":0},null,{"$f":"IF(Tecno!H18<>\"\",Tecno!H18,\"\")","v":""},null,227.99999999999997]
["Adubação",{"$f":"Tecno!B19","v":1.2},{"$f":"Tecno!C19","v":1.2},{"$f":"B19*Componentes!$J$12+C19*Componentes!$J$13","v":28.772354948805457},{"$f":"IF(Tecno!E19<>\"\",Tecno!E19,\"\")","v":"NPK-6:30:6"},{"$f":"(Tecno!F19)*1.3","v":260},{"$f":"F19*Componentes!$E$52/1000","v":260},{"$f":"IF(Tecno!H19<>\"\",Tecno!H19,\"\")","v":"MF 290 + Aplicador Adubo Granulado"},{"$f":"Componentes!J37*C19","v":86.024999999999991},374.79735494880543]
["Plantio",{"$f":"Tecno!B20","v":12},{"$f":"Tecno!C20","v":3},{"$f":"B20*Componentes!$J$12+C20*Componentes!$J$13","v":200.18088737201361},{"$f":"IF(Tecno!E20<>\"\",Tecno!E20,\"\")","v":"Mudas"},833,{"$f":"F20*Componentes!E46/1000","v":291.55},{"$f":"IF(Tecno!H20<>\"\",Tecno!H20,\"\")","v":"Valmet 880 + carreta"},{"$f":"Componentes!J39*C20","v":155.39999999999998},{"$f":"D20+G20+I20","v":647.1308873720136}]
["Irrigação",{"$f":"Tecno!B21","v":0},{"$f":"Tecno!C21","v":0},{"$f":"B21*Componentes!$J$12+C21*Componentes!$J$13","v":0},{"$f":"IF(Tecno!E21<>\"\",Tecno!E21,\"\")","v":""},{"$f":"Tecno!F21","v":0},null,{"$f":"IF(Tecno!H21<>\"\",Tecno!H21,\"\")","v":""},{"$f":"1.31*Componentes!J31","v":57.558125000000004},{"$f":"D21+G21+I21","v":57.558125000000004}]
["Levantamento Sobrevivência",{"$f":"Tecno!B22","v":0},{"$f":"Tecno!C22","v":0},{"$f":"B22*Componentes!$J$12+C22*Componentes!$J$13","v":0},{"$f":"IF(Tecno!E22<>\"\",Tecno!E22,\"\")","v":""},{"$f":"Tecno!F22","v":0},null,{"$f":"IF(Tecno!H22<>\"\",Tecno!H22,\"\")","v":""},null,{"$f":"D22+G22+I22","v":0}]
["Replantio",{"$f":"Tecno!B23","v":0},{"$f":"Tecno!C23","v":0},{"$f":"B23*Componentes!$J$12+C23*Componentes!$J$13","v":0},{"$f":"IF(Tecno!E23<>\"\",Tecno!E23,\"\")","v":""},{"$f":"Tecno!F23","v":0},null,{"$f":"IF(Tecno!H23<>\"\",Tecno!H23,\"\")","v":""},{"$f":"Componentes!J39*C23","v":0},{"$f":"D23+G23+I23","v":0}]
["Adubação cobertura",{"$f":"Tecno!B24","v":0},{"$f":"Tecno!C24","v":0},{"$f":"B24*Componentes!$J$12+C24*Componentes!$J$13","v":0},{"$f":"IF(Tecno!E24<>\"\",Tecno!E24,\"\")","v":""},{"$f":"Tecno!F24","v":0},{"$f":"F24*Componentes!E54/1000","v":0},{"$f":"IF(Tecno!H24<>\"\",Tecno!H24,\"\")","v":""},{"$f":"Componentes!J37*C24","v":0},{"$f":"D24+G24+I24","v":0}]
["Primeira Manutenção",null,null,null,null,null,null,null,null,{"$f":"SUM(J10:J24)+Componentes!$H$4","v":2058.7187222696248}]
[]
["Conservação do Solo",{"$f":"Tecno!B27","v":0},{"$f":"Tecno!C27","v":0},{"$f":"B27*Componentes!$J$12+C27*Componentes!$J$13","v":0},{"$f":"IF(Tecno!E27<>\"\",Tecno!E27,\"\")","v":""},{"$f":"Tecno!F27","v":0},null,{"$f":"IF(Tecno!H27<>\"\",Tecno!H27,\"\")","v":""},{"$f":"Componentes!$J$29*C27","v":0},{"$f":"D27+G27+I27","v":0}]
["Controle Químico Linha ",{"$f":"Tecno!B28","v":6},{"$f":"Tecno!C28","v":0},{"$f":"B28*Componentes!$J$12+C28*Componentes!$J$13","v":85.499999999999986},{"$f":"IF(Tecno!E28<>\"\",Tecno!E28,\"\")","v":"Round up"},{"$f":"Tecno!F28","v":0.94},{"$f":"F28*Componentes!$E$56","v":63.778999999999989},{"$f":"IF(Tecno!H28<>\"\",Tecno!H28,\"\")","v":"Pulverizador costal motorizado"},{"$f":"Componentes!J23*B28","v":21.3675},170.64649999999997]
["Controle Químico Entrelinha",{"$f":"Tecno!B29","v":0},{"$f":"Tecno!C29","v":0},{"$f":"B29*Componentes!$J$12+C29*Componentes!$J$13","v":0},{"$f":"IF(Tecno!E29<>\"\",Tecno!E29,\"\")","v":""},{"$f":"Tecno!F29","v":0},{"$f":"F29*Componentes!$E$56","v":0},{"$f":"IF(Tecno!H29<>\"\",Tecno!H29,\"\")","v":""},{"$f":"Componentes!$J$31*C29","v":0},0]
["Controle de formigas",{"$f":"Tecno!B30","v":1.8},{"$f":"Tecno!C30","v":0},{"$f":"B30*Componentes!$J$12+C30*Componentes!$J$13","v":25.65},{"$f":"IF(Tecno!E30<>\"\",Tecno!E30,\"\")","v":"Formicida granulado"},{"$f":"Tecno!F30","v":0.7},{"$f":"F30*Componentes!$E$55","v":30.869999999999997},{"$f":"IF(Tecno!H30<>\"\",Tecno!H30,\"\")","v":"Caminhão + Carreta 4 ton."},null,56.519999999999996]
["Adubação de reforço manual",null,null,null,null,null,null,{"$f":"IF(Tecno!H31<>\"\",Tecno!H31,\"\")","v":""},null,0]
["Manutenção de Aceiros",{"$f":"Tecno!B32","v":0},{"$f":"Tecno!C32","v":0},{"$f":"B32*Componentes!$J$12+C32*Componentes!$J$13","v":0},{"$f":"IF(Tecno!E32<>\"\",Tecno!E32,\"\")","v":""},{"$f":"Tecno!F32","v":0},null,{"$f":"IF(Tecno!H32<>\"\",Tecno!H32,\"\")","v":""},{"$f":"Componentes!$J$29*C32","v":0},0]
["Segunda Manutenção",null,null,null,null,null,null,null,null,{"$f":"SUM(J27:J32)+Componentes!$H$4","v":427.16649999999998}]
[]
["Controle Químico Entrelinha",{"$f":"Tecno!B35","v":0},{"$f":"Tecno!C35","v":0},{"$f":"B35*Componentes!$J$12+C35*Componentes!$J$13","v":0},{"$f":"IF(Tecno!E35<>\"\",Tecno!E35,\"\")","v":""},{"$f":"Tecno!F35","v":0},{"$f":"F35*Componentes!$E$56","v":0},{"$f":"IF(Tecno!H35<>\"\",Tecno!H35,\"\")","v":""},{"$f":"Componentes!$J$31*C35","v":0},{"$f":"D35+G35+I35","v":0}]
["Fosfatagem",null,null,null,null,null,null,null,null,{"$f":"D36+G36+I36","v":0}]
["Roçada Manual Linha",{"$f":"Tecno!B37","v":8},{"$f":"Tecno!C37","v":0},{"$f":"B37*Componentes!$J$12+C37*Componentes!$J$13","v":113.99999999999999},{"$f":"IF(Tecno!E37<>\"\",Tecno!E37,\"\")","v":""},{"$f":"Tecno!F37","v":0},null,{"$f":"IF(Tecno!H37<>\"\",Tecno!H37,\"\")","v":""},null,{"$f":"D37+G37+I37","v":113.99999999999999}]
["Patrolamento Aceiro",{"$f":"Tecno!B38","v":0},{"$f":"Tecno!C38","v":0},{"$f":"B38*Componentes!$J$12+C38*Componentes!$J$13","v":0},{"$f":"IF(Tecno!E38<>\"\",Tecno!E38,\"\")","v":""},{"$f":"Tecno!F38","v":0},null,{"$f":"IF(Tecno!H38<>\"\",Tecno!H38,\"\")","v":""},{"$f":"Componentes!$J$28*C38","v":0},{"$f":"D38+G38+I38","v":0}]
["Terceira Manutenção",null,null,null,null,null,null,null,null,{"$f":"SUM(J35:J38)+Componentes!$H$4","v":314}]
[]
["Controle Químico Entrelinha",{"$f":"Tecno!B41","v":0},{"$f":"Tecno!C41","v":0},{"$f":"B41*Componentes!$J$12+C41*Componentes!$J$13","v":0},{"$f":"IF(Tecno!E41<>\"\",Tecno!E41,\"\")","v":""},{"$f":"Tecno!F41","v":0},{"$f":"F41*Componentes!$E$56","v":0},{"$f":"IF(Tecno!H41<>\"\",Tecno!H41,\"\")","v":""},{"$f":"Componentes!$J$31*C41","v":0},{"$f":"D41+G41+I41","v":0}]
["Adubação de Manutenção",null,null,null,null,null,null,null,null,{"$f":"D42+G42+I42","v":0}]
["Controle formiga manutenção",{"$f":"Tecno!B43","v":1.4},{"$f":"Tecno!C43","v":0},{"$f":"B43*Componentes!$J$12+C43*Componentes!$J$13","v":19.949999999999996},{"$f":"IF(Tecno!E43<>\"\",Tecno!E43,\"\")","v":"Formicida granulado"},{"$f":"Tecno!F43","v":0.6},{"$f":"F43*Componentes!$E$55","v":26.46},{"$f":"IF(Tecno!H43<>\"\",Tecno!H43,\"\")","v":""},null,{"$f":"D43+G43+I43","v":46.41}]
["Patrolamento Aceiro",{"$f":"Tecno!B44","v":0},{"$f":"Tecno!C44","v":0},{"$f":"B44*Componentes!$J$12+C44*Componentes!$J$13","v":0},{"$f":"IF(Tecno!E44<>\"\",Tecno!E44,\"\")","v":""},{"$f":"Tecno!F44","v":0},null,{"$f":"IF(Tecno!H44<>\"\",Tecno!H44,\"\")","v":""},{"$f":"Componentes!$J$28*C44","v":0},{"$f":"D44+G44+I44","v":0}]
["Demais Manutenções",null,null,null,null,null,null,null,null,{"$f":"SUM(J41:J44)+Componentes!$H$4","v":246.41}]
[]
["Controle formiga manutenção",{"$f":"Tecno!B47","v":1.4},{"$f":"Tecno!C47","v":0},{"$f":"B47*Componentes!$J$12+C47*Componentes!$J$13","v":19.949999999999996},{"$f":"IF(Tecno!E47<>\"\",Tecno!E47,\"\")","v":"Formicida granulado"},{"$f":"Tecno!F47","v":0.6},{"$f":"F47*Componentes!$E$55","v":26.46},{"$f":"IF(Tecno!H47<>\"\",Tecno!H47,\"\")","v":""},null,{"$f":"D47+G47+I47","v":46.41}]
["Patrolamento Aceiro",{"$f":"Tecno!B48","v":0},{"$f":"Tecno!C48","v":0},{"$f":"B48*Componentes!$J$12+C48*Componentes!$J$13","v":0},{"$f":"IF(Tecno!E48<>\"\",Tecno!E48,\"\")","v":""},{"$f":"Tecno!F48","v":0},null,{"$f":"IF(Tecno!H48<>\"\",Tecno!H48,\"\")","v":""},{"$f":"Componentes!$J$28*C48","v":0},{"$f":"D48+G48+I48","v":0}]
[null,null,null,null,null,null,null,null,null,{"$f":"SUM(J47:J48)+Componentes!$H$4","v":246.41}]
["Primeiro Desbaste"]
[null,"Ano:",4]
["Marcação",{"$f":"Tecno!$B$62","v":12},null,{"$f":"B52*Componentes!$J$12","v":170.99999999999997},null,null,null,null,null,{"$f":"D52+G52+I52","v":170.99999999999997}]
["Desrama",{"$f":"Tecno!$B$62","v":12},null,{"$f":"B53*Componentes!$J$12","v":170.99999999999997},null,null,null,{"$f":"IF(Tecno!H53<>\"\",Tecno!H53,\"\")","v":""},null,{"$f":"D53+G53+I53","v":170.99999999999997}]
[null,null,null,null,null,null,null,null,null,{"$f":"SUM(J52:J53)","v":341.99999999999994}]
["Segundo Desbaste"]
[null,"Ano:",8]
["Marcação",{"$f":"Tecno!$B$62*1.2","v":14.399999999999999},null,{"$f":"B57*Componentes!$J$12","v":205.19999999999996},null,null,null,null,null,{"$f":"D57+G57+I57","v":205.19999999999996}]
["Desrama",{"$f":"Tecno!$B$62*1.2","v":14.399999999999999},null,{"$f":"B58*Componentes!$J$12","v":205.19999999999996},null,null,null,{"$f":"IF(Tecno!H58<>\"\",Tecno!H58,\"\")","v":""},null,{"$f":"D58+G58+I58","v":205.19999999999996}]
[null,null,null,null,null,null,null,null,null,{"$f":"SUM(J57:J58)","v":410.39999999999992}]
["Corte Raso"]
[null,"Ano:",15]
["Patrolamento Estradas",null,{"$f":"Tecno!C48","v":0},{"$f":"(C62*Componentes!J13)*4","v":0},null,null,null,{"$f":"Tecno!H48","v":0},null,{"$f":"D62+G62+I62","v":0}]
[null,null,null,null,null,null,null,null,null,{"$f":"SUM(J62)","v":0}]

{"sheet":"PinPol","index":10,"n_rows":49,"n_cols":10,"rows_kept":49,"cut":false,"hidden":false,"merged":[[7,0,8,0],[7,1,7,3],[7,4,7,6],[7,7,7,8],[24,0,25,0],[24,1,24,3],[24,4,24,6],[0,0,0,6],[1,0,1,6],[2,0,2,6],[3,0,3,6],[4,0,4,6],[44,0,45,0],[44,1,44,3],[44,4,44,6],[44,7,44,8],[24,7,24,8],[38,0,39,0],[38,1,38,3],[38,4,38,6],[38,7,38,8],[32,0,33,0],[32,1,32,3],[32,4,32,6],[32,7,32,8]]}
["Detalhamento dos Custos das Operações - Pinus p/ Polpa"]
["(Rendimento técnico da MDO em homem-hora/hectare)"]
["(Para MDO, considerou-se apenas MDO tipo braçal e tratorista)"]
["(Rendimento técnico do equipamento em hora-máquina/hectare)"]
["(Custo total da operação em $/hectare)"]
[]
["PRIMEIRA ROTAÇÃO"]
["Plantio","Mão-de-Obra",null,null,"Insumo",null,null,"Máquinas"]
[null,"Braçal","Tratorista","Custo","Produto","Quantidade","Custo","Equipamento","Custo","Custo Total"]
["Conservação do Solo",{"$f":"Tecno!B10","v":0},{"$f":"Tecno!C10","v":0},{"$f":"B10*Componentes!$J$12+C10*Componentes!$J$13","v":0},{"$f":"IF(Tecno!E10<>\"\",Tecno!E10,\"\")","v":""},{"$f":"Tecno!F10","v":0},null,{"$f":"IF(Tecno!H10<>\"\",Tecno!H10,\"\")","v":""},{"$f":"Componentes!J29*C10","v":0},{"$f":"D10+G10+I10","v":0}]
["Construção de Aceiros",{"$f":"Tecno!B11","v":0},{"$f":"Tecno!C11","v":0},{"$f":"B11*Componentes!$J$12+C11*Componentes!$J$13","v":0},{"$f":"IF(Tecno!E11<>\"\",Tecno!E11,\"\")","v":""},{"$f":"Tecno!F11","v":0},null,{"$f":"IF(Tecno!H11<>\"\",Tecno!H11,\"\")","v":""},{"$f":"Componentes!J29*C11","v":0},{"$f":"D11+G11+I11","v":0}]
["Calagem",{"$f":"Tecno!B12","v":1.2},{"$f":"Tecno!C12","v":1.2},{"$f":"B12*Componentes!$J$12+C12*Componentes!$J$13","v":28.772354948805457},{"$f":"IF(Tecno!E12<>\"\",Tecno!E12,\"\")","v":"Calcário dolomítico"},{"$f":"Tecno!F12","v":4},{"$f":"F12*Componentes!E47","v":340},{"$f":"IF(Tecno!H12<>\"\",Tecno!H12,\"\")","v":"MF 290 + Aplicador calcário"},{"$f":"Componentes!J36*C12","v":83.25},{"$f":"D12+G12+I12","v":452.02235494880546}]
["Combate a formiga 1",{"$f":"Tecno!B13","v":2.3199999999999998},{"$f":"Tecno!C13","v":0},{"$f":"B13*Componentes!$J$12+C13*Componentes!$J$13","v":33.059999999999995},{"$f":"IF(Tecno!E13<>\"\",Tecno!E13,\"\")","v":"Formicida granulado"},{"$f":"Tecno!F13","v":1.5},{"$f":"F13*Componentes!$E$55","v":66.150000000000006},{"$f":"IF(Tecno!H13<>\"\",Tecno!H13,\"\")","v":""},null,99.210000000000008]
["Combate a formiga 2",{"$f":"Tecno!B14","v":0},{"$f":"Tecno!C14","v":0},{"$f":"B14*Componentes!$J$12+C14*Componentes!$J$13","v":0},{"$f":"IF(Tecno!E14<>\"\",Tecno!E14,\"\")","v":""},{"$f":"Tecno!F14","v":0},{"$f":"F14*Componentes!$E$55","v":0},{"$f":"IF(Tecno!H14<>\"\",Tecno!H14,\"\")","v":""},null,0]
["Combate a formiga 3",{"$f":"Tecno!B15","v":0},{"$f":"Tecno!C15","v":0},{"$f":"B15*Componentes!$J$12+C15*Componentes!$J$13","v":0},{"$f":"IF(Tecno!E15<>\"\",Tecno!E15,\"\")","v":""},{"$f":"Tecno!F15","v":0},{"$f":"F15*Componentes!$E$55","v":0},{"$f":"IF(Tecno!H15<>\"\",Tecno!H15,\"\")","v":""},null,0]
["Controle Químico Mec. Total",{"$f":"Tecno!B16","v":0},{"$f":"Tecno!C16","v":0},{"$f":"B16*Componentes!$J$12+C16*Componentes!$J$13","v":0},{"$f":"IF(Tecno!E16<>\"\",Tecno!E16,\"\")","v":""},{"$f":"Tecno!F16","v":0},{"$f":"F16*Componentes!$E$56","v":0},{"$f":"IF(Tecno!H16<>\"\",Tecno!H16,\"\")","v":""},{"$f":"Componentes!$J$31*C16","v":0},0]
["Subsolagem",{"$f":"Tecno!B17","v":0},{"$f":"Tecno!C17","v":0},{"$f":"B17*Componentes!$J$12+C17*Componentes!$J$13","v":0},{"$f":"IF(Tecno!E17<>\"\",Tecno!E17,\"\")","v":""},{"$f":"Tecno!F17","v":0},null,{"$f":"IF(Tecno!H17<>\"\",Tecno!H17,\"\")","v":""},{"$f":"Componentes!J40*C17","v":0},0]
["Coveamento",{"$f":"Tecno!B18","v":16},{"$f":"Tecno!C18","v":0},{"$f":"B18*Componentes!$J$12+C18*Componentes!$J$13","v":227.99999999999997},{"$f":"IF(Tecno!E18<>\"\",Tecno!E18,\"\")","v":""},{"$f":"Tecno!F18","v":0},null,{"$f":"IF(Tecno!H18<>\"\",Tecno!H18,\"\")","v":""},null,227.99999999999997]
["Adubação",{"$f":"Tecno!B19","v":1.2},{"$f":"Tecno!C19","v":1.2},{"$f":"B19*Componentes!$J$12+C19*Componentes!$J$13","v":28.772354948805457},{"$f":"IF(Tecno!E19<>\"\",Tecno!E19,\"\")","v":"NPK-6:30:6"},{"$f":"Tecno!F19","v":200},{"$f":"F19*Componentes!$E$52/1000","v":200},{"$f":"IF(Tecno!H19<>\"\",Tecno!H19,\"\")","v":"MF 290 + Aplicador Adubo Granulado"},{"$f":"Componentes!J37*C19","v":86.024999999999991},314.79735494880543]
["Plantio",{"$f":"Tecno!B20","v":12},{"$f":"Tecno!C20","v":3},{"$f":"B20*Componentes!$J$12+C20*Componentes!$J$13","v":200.18088737201361},{"$f":"IF(Tecno!E20<>\"\",Tecno!E20,\"\")","v":"Mudas"},1111,{"$f":"F20*Componentes!E46/1000","v":388.85},{"$f":"IF(Tecno!H20<>\"\",Tecno!H20,\"\")","v":"Valmet 880 + carreta"},{"$f":"Componentes!J39*C20","v":155.39999999999998},{"$f":"D20+G20+I20","v":744.43088737201367}]
["Irrigação",{"$f":"Tecno!B21","v":0},{"$f":"Tecno!C21","v":0},{"$f":"B21*Componentes!$J$12+C21*Componentes!$J$13","v":0},{"$f":"IF(Tecno!E21<>\"\",Tecno!E21,\"\")","v":""},{"$f":"Tecno!F21","v":0},null,{"$f":"IF(Tecno!H21<>\"\",Tecno!H21,\"\")","v":""},{"$f":"1.31*Componentes!J31","v":57.558125000000004},{"$f":"D21+G21+I21","v":57.558125000000004}]
["Levantamento Sobrevivência",{"$f":"Tecno!B22","v":0},{"$f":"Tecno!C22","v":0},{"$f":"B22*Componentes!$J$12+C22*Componentes!$J$13","v":0},{"$f":"IF(Tecno!E22<>\"\",Tecno!E22,\"\")","v":""},{"$f":"Tecno!F22","v":0},null,{"$f":"IF(Tecno!H22<>\"\",Tecno!H22,\"\")","v":""},null,{"$f":"D22+G22+I22","v":0}]
["Replantio",{"$f":"Tecno!B23","v":0},{"$f":"Tecno!C23","v":0},{"$f":"B23*Componentes!$J$12+C23*Componentes!$J$13","v":0},{"$f":"IF(Tecno!E23<>\"\",Tecno!E23,\"\")","v":""},{"$f":"Tecno!F23","v":0},null,{"$f":"IF(Tecno!H23<>\"\",Tecno!H23,\"\")","v":""},{"$f":"Componentes!J39*C23","v":0},{"$f":"D23+G23+I23","v":0}]
["Adubação cobertura",null,null,null,null,null,null,null,null,{"$f":"D24+G24+I24","v":0}]
["Primeira Manutenção",null,null,null,null,null,null,null,null,{"$f":"SUM(J10:J24)+Componentes!$H$4","v":2096.0187222696245}]
[]
["Conservação do Solo",{"$f":"Tecno!B27","v":0},{"$f":"Tecno!C27","v":0},{"$f":"B27*Componentes!$J$12+C27*Componentes!$J$13","v":0},{"$f":"IF(Tecno!E27<>\"\",Tecno!E27,\"\")","v":""},{"$f":"Tecno!F27","v":0},null,{"$f":"IF(Tecno!H27<>\"\",Tecno!H27,\"\")","v":""},{"$f":"Componentes!$J$29*C27","v":0},{"$f":"D27+G27+I27","v":0}]
["Controle Químico Linha ",{"$f":"Tecno!B28","v":6},{"$f":"Tecno!C28","v":0},{"$f":"B28*Componentes!$J$12+C28*Componentes!$J$13","v":85.499999999999986},{"$f":"IF(Tecno!E28<>\"\",Tecno!E28,\"\")","v":"Round up"},{"$f":"Tecno!F28","v":0.94},{"$f":"F28*Componentes!$E$56","v":63.778999999999989},{"$f":"IF(Tecno!H28<>\"\",Tecno!H28,\"\")","v":"Pulverizador costal motorizado"},{"$f":"Componentes!J23*B28","v":21.3675},170.64649999999997]
["Controle Químico Entrelinha",{"$f":"Tecno!B29","v":0},{"$f":"Tecno!C29","v":0},{"$f":"B29*Componentes!$J$12+C29*Componentes!$J$13","v":0},{"$f":"IF(Tecno!E29<>\"\",Tecno!E29,\"\")","v":""},{"$f":"Tecno!F29","v":0},{"$f":"F29*Componentes!$E$56","v":0},{"$f":"IF(Tecno!H29<>\"\",Tecno!H29,\"\")","v":""},{"$f":"Componentes!$J$31*C29","v":0},0]
["Controle de formigas",{"$f":"Tecno!B30","v":1.8},{"$f":"Tecno!C30","v":0},{"$f":"B30*Componentes!$J$12+C30*Componentes!$J$13","v":25.65},{"$f":"IF(Tecno!E30<>\"\",Tecno!E30,\"\")","v":"Formicida granulado"},{"$f":"Tecno!F30","v":0.7},{"$f":"F30*Componentes!$E$55","v":30.869999999999997},{"$f":"IF(Tecno!H30<>\"\",Tecno!H30,\"\")","v":"Caminhão + Carreta 4 ton."},null,56.519999999999996]
["Adubação de reforço manual",null,null,null,null,null,null,{"$f":"IF(Tecno!H31<>\"\",Tecno!H31,\"\")","v":""},null,0]
["Manutenção de Aceiros",{"$f":"Tecno!B32","v":0},{"$f":"Tecno!C32","v":0},{"$f":"B32*Componentes!$J$12+C32*Componentes!$J$13","v":0},{"$f":"IF(Tecno!E32<>\"\",Tecno!E32,\"\")","v":""},{"$f":"Tecno!F32","v":0},null,{"$f":"IF(Tecno!H32<>\"\",Tecno!H32,\"\")","v":""},{"$f":"Componentes!$J$29*C32","v":0},0]
["Segunda Manutenção",null,null,null,null,null,null,null,null,{"$f":"SUM(J27:J32)+Componentes!$H$4","v":427.16649999999998}]
[]
["Controle Químico Entrelinha",{"$f":"Tecno!B35","v":0},{"$f":"Tecno!C35","v":0},{"$f":"B35*Componentes!$J$12+C35*Componentes!$J$13","v":0},{"$f":"IF(Tecno!E35<>\"\",Tecno!E35,\"\")","v":""},{"$f":"Tecno!F35","v":0},{"$f":"F35*Componentes!$E$56","v":0},{"$f":"IF(Tecno!H35<>\"\",Tecno!H35,\"\")","v":""},{"$f":"Componentes!$J$31*C35","v":0},{"$f":"D35+G35+I35","v":0}]
["Fosfatagem",null,null,null,null,null,null,null,null,{"$f":"D36+G36+I36","v":0}]
["Roçada Manual Linha",{"$f":"Tecno!B37","v":8},{"$f":"Tecno!C37","v":0},{"$f":"B37*Componentes!$J$12+C37*Componentes!$J$13","v":113.99999999999999},{"$f":"IF(Tecno!E37<>\"\",Tecno!E37,\"\")","v":""},{"$f":"Tecno!F37","v":0},null,{"$f":"IF(Tecno!H37<>\"\",Tecno!H37,\"\")","v":""},null,{"$f":"D37+G37+I37","v":113.99999999999999}]
["Patrolamento Aceiro",{"$f":"Tecno!B38","v":0},{"$f":"Tecno!C38","v":0},{"$f":"B38*Componentes!$J$12+C38*Componentes!$J$13","v":0},{"$f":"IF(Tecno!E38<>\"\",Tecno!E38,\"\")","v":""},{"$f":"Tecno!F38","v":0},null,{"$f":"IF(Tecno!H38<>\"\",Tecno!H38,\"\")","v":""},{"$f":"Componentes!$J$28*C38","v":0},{"$f":"D38+G38+I38","v":0}]
["Terceira Manutenção",null,null,null,null,null,null,null,null,{"$f":"SUM(J35:J38)+Componentes!$H$4","v":314}]
[]
["Controle Químico Entrelinha",{"$f":"Tecno!B41","v":0},{"$f":"Tecno!C41","v":0},{"$f":"B41*Componentes!$J$12+C41*Componentes!$J$13","v":0},{"$f":"IF(Tecno!E41<>\"\",Tecno!E41,\"\")","v":""},{"$f":"Tecno!F41","v":0},{"$f":"F41*Componentes!$E$56","v":0},{"$f":"IF(Tecno!H41<>\"\",Tecno!H41,\"\")","v":""},{"$f":"Componentes!$J$31*C41","v":0},{"$f":"D41+G41+I41","v":0}]
["Adubação de Manutenção",null,null,null,null,null,null,null,null,{"$f":"D42+G42+I42","v":0}]
["Controle formiga manutenção",{"$f":"Tecno!B43","v":1.4},{"$f":"Tecno!C43","v":0},{"$f":"B43*Componentes!$J$12+C43*Componentes!$J$13","v":19.949999999999996},{"$f":"IF(Tecno!E43<>\"\",Tecno!E43,\"\")","v":"Formicida granulado"},{"$f":"Tecno!F43","v":0.6},{"$f":"F43*Componentes!$E$55","v":26.46},{"$f":"IF(Tecno!H43<>\"\",Tecno!H43,\"\")","v":""},null,{"$f":"D43+G43+I43","v":46.41}]
["Patrolamento Aceiro",{"$f":"Tecno!B44","v":0},{"$f":"Tecno!C44","v":0},{"$f":"B44*Componentes!$J$12+C44*Componentes!$J$13","v":0},{"$f":"IF(Tecno!E44<>\"\",Tecno!E44,\"\")","v":""},{"$f":"Tecno!F44","v":0},null,{"$f":"IF(Tecno!H44<>\"\",Tecno!H44,\"\")","v":""},{"$f":"Componentes!$J$28*C44","v":0},{"$f":"D44+G44+I44","v":0}]
["Demais Manutenções",null,null,null,null,null,null,null,null,{"$f":"SUM(J41:J44)+Componentes!$H$4","v":246.41}]
[]
["Controle formiga manutenção",{"$f":"Tecno!B47","v":1.4},{"$f":"Tecno!C47","v":0},{"$f":"B47*Componentes!$J$12+C47*Componentes!$J$13","v":19.949999999999996},{"$f":"IF(Tecno!E47<>\"\",Tecno!E47,\"\")","v":"Formicida granulado"},{"$f":"Tecno!F47","v":0.6},{"$f":"F47*Componentes!$E$55","v":26.46},{"$f":"IF(Tecno!H47<>\"\",Tecno!H47,\"\")","v":""},null,{"$f":"D47+G47+I47","v":46.41}]
["Patrolamento Aceiro",{"$f":"Tecno!B48","v":0},{"$f":"Tecno!C48","v":0},{"$f":"B48*Componentes!$J$12+C48*Componentes!$J$13","v":0},{"$f":"IF(Tecno!E48<>\"\",Tecno!E48,\"\")","v":""},{"$f":"Tecno!F48","v":0},null,{"$f":"IF(Tecno!H48<>\"\",Tecno!H48,\"\")","v":""},{"$f":"Componentes!$J$28*C48","v":0},{"$f":"D48+G48+I48","v":0}]
[null,null,null,null,null,null,null,null,null,{"$f":"SUM(J47:J48)+Componentes!$H$4","v":246.41}]

{"sheet":"PinMadSol","index":11,"n_rows":63,"n_cols":10,"rows_kept":63,"cut":false,"hidden":false,"merged":[[7,0,8,0],[7,1,7,3],[7,4,7,6],[7,7,7,8],[24,0,25,0],[24,1,24,3],[24,4,24,6],[24,7,24,8],[0,0,0,6],[1,0,1,6],[2,0,2,6],[3,0,3,6],[4,0,4,6],[38,0,39,0],[38,1,38,3],[38,4,38,6],[38,7,38,8],[32,0,33,0],[32,1,32,3],[32,4,32,6],[32,7,32,8],[44,0,45,0],[44,1,44,3],[44,4,44,6],[44,7,44,8],[59,0,60,0],[59,1,59,3],[59,4,59,6],[59,7,59,8],[49,0,50,0],[49,1,49,3],[49,4,49,6],[49,7,49,8],[54,0,55,0],[54,1,54,3],[54,4,54,6],[54,7,54,8]]}
["Detalhamento dos Custos das Operações - Pinus p/ Madeira Sólida"]
["(Rendimento técnico da MDO em homem-hora/hectare)"]
["(Para MDO, considerou-se apenas MDO tipo braçal e tratorista)"]
["(Rendimento técnico do equipamento em hora-máquina/hectare)"]
["(Custo total da operação em $/hectare)"]
[]
["PRIMEIRA ROTAÇÃO"]
["Plantio","Mão-de-Obra",null,null,"Insumo",null,null,"Máquinas"]
[null,"Braçal","Tratorista","Custo","Produto","Quantidade","Custo","Equipamento","Custo","Custo Total"]
["Conservação do Solo",{"$f":"Tecno!B10","v":0},{"$f":"Tecno!C10","v":0},{"$f":"B10*Componentes!$J$12+C10*Componentes!$J$13","v":0},{"$f":"IF(Tecno!E10<>\"\",Tecno!E10,\"\")","v":""},{"$f":"Tecno!F10","v":0},null,{"$f":"IF(Tecno!H10<>\"\",Tecno!H10,\"\")","v":""},{"$f":"Componentes!J29*C10","v":0},{"$f":"D10+G10+I10","v":0}]
["Construção de Aceiros",{"$f":"Tecno!B11","v":0},{"$f":"Tecno!C11","v":0},{"$f":"B11*Componentes!$J$12+C11*Componentes!$J$13","v":0},{"$f":"IF(Tecno!E11<>\"\",Tecno!E11,\"\")","v":""},{"$f":"Tecno!F11","v":0},null,{"$f":"IF(Tecno!H11<>\"\",Tecno!H11,\"\")","v":""},{"$f":"Componentes!J29*C11","v":0},{"$f":"D11+G11+I11","v":0}]
["Calagem",{"$f":"Tecno!B12","v":1.2},{"$f":"Tecno!C12","v":1.2},{"$f":"B12*Componentes!$J$12+C12*Componentes!$J$13","v":28.772354948805457},{"$f":"IF(Tecno!E12<>\"\",Tecno!E12,\"\")","v":"Calcário dolomítico"},{"$f":"Tecno!F12","v":4},{"$f":"F12*Componentes!E47","v":340},{"$f":"IF(Tecno!H12<>\"\",Tecno!H12,\"\")","v":"MF 290 + Aplicador calcário"},{"$f":"Componentes!J36*C12","v":83.25},{"$f":"D12+G12+I12","v":452.02235494880546}]
["Combate a formiga 1",{"$f":"Tecno!B13","v":2.3199999999999998},{"$f":"Tecno!C13","v":0},{"$f":"B13*Componentes!$J$12+C13*Componentes!$J$13","v":33.059999999999995},{"$f":"IF(Tecno!E13<>\"\",Tecno!E13,\"\")","v":"Formicida granulado"},{"$f":"Tecno!F13","v":1.5},{"$f":"F13*Componentes!$E$55","v":66.150000000000006},{"$f":"IF(Tecno!H13<>\"\",Tecno!H13,\"\")","v":""},null,99.210000000000008]
["Combate a formiga 2",{"$f":"Tecno!B14","v":0},{"$f":"Tecno!C14","v":0},{"$f":"B14*Componentes!$J$12+C14*Componentes!$J$13","v":0},{"$f":"IF(Tecno!E14<>\"\",Tecno!E14,\"\")","v":""},{"$f":"Tecno!F14","v":0},{"$f":"F14*Componentes!$E$55","v":0},{"$f":"IF(Tecno!H14<>\"\",Tecno!H14,\"\")","v":""},null,0]
["Combate a formiga 3",{"$f":"Tecno!B15","v":0},{"$f":"Tecno!C15","v":0},{"$f":"B15*Componentes!$J$12+C15*Componentes!$J$13","v":0},{"$f":"IF(Tecno!E15<>\"\",Tecno!E15,\"\")","v":""},{"$f":"Tecno!F15","v":0},{"$f":"F15*Componentes!$E$55","v":0},{"$f":"IF(Tecno!H15<>\"\",Tecno!H15,\"\")","v":""},null,0]
["Controle Químico Mec. Total",{"$f":"Tecno!B16","v":0},{"$f":"Tecno!C16","v":0},{"$f":"B16*Componentes!$J$12+C16*Componentes!$J$13","v":0},{"$f":"IF(Tecno!E16<>\"\",Tecno!E16,\"\")","v":""},{"$f":"Tecno!F16","v":0},{"$f":"F16*Componentes!$E$56","v":0},{"$f":"IF(Tecno!H16<>\"\",Tecno!H16,\"\")","v":""},{"$f":"Componentes!$J$31*C16","v":0},0]
["Subsolagem",{"$f":"Tecno!B17","v":0},{"$f":"Tecno!C17","v":0},{"$f":"B17*Componentes!$J$12+C17*Componentes!$J$13","v":0},{"$f":"IF(Tecno!E17<>\"\",Tecno!E17,\"\")","v":""},{"$f":"Tecno!F17","v":0},null,{"$f":"IF(Tecno!H17<>\"\",Tecno!H17,\"\")","v":""},{"$f":"Componentes!J40*C17","v":0},0]
["Coveamento",{"$f":"Tecno!B18","v":16},{"$f":"Tecno!C18","v":0},{"$f":"B18*Componentes!$J$12+C18*Componentes!$J$13","v":227.99999999999997},{"$f":"IF(Tecno!E18<>\"\",Tecno!E18,\"\")","v":""},{"$f":"Tecno!F18","v":0},null,{"$f":"IF(Tecno!H18<>\"\",Tecno!H18,\"\")","v":""},null,227.99999999999997]
["Adubação",{"$f":"Tecno!B19","v":1.2},{"$f":"Tecno!C19","v":1.2},{"$f":"B19*Componentes!$J$12+C19*Componentes!$J$13","v":28.772354948805457},{"$f":"IF(Tecno!E19<>\"\",Tecno!E19,\"\")","v":"NPK-6:30:6"},{"$f":"Tecno!F19","v":200},{"$f":"F19*Componentes!$E$52/1000","v":200},{"$f":"IF(Tecno!H19<>\"\",Tecno!H19,\"\")","v":"MF 290 + Aplicador Adubo Granulado"},{"$f":"Componentes!J37*C19","v":86.024999999999991},314.79735494880543]
["Plantio",{"$f":"Tecno!B20","v":12},{"$f":"Tecno!C20","v":3},{"$f":"B20*Componentes!$J$12+C20*Componentes!$J$13","v":200.18088737201361},{"$f":"IF(Tecno!E20<>\"\",Tecno!E20,\"\")","v":"Mudas"},1111,{"$f":"F20*Componentes!E46/1000","v":388.85},{"$f":"IF(Tecno!H20<>\"\",Tecno!H20,\"\")","v":"Valmet 880 + carreta"},{"$f":"Componentes!J39*C20","v":155.39999999999998},{"$f":"D20+G20+I20","v":744.43088737201367}]
["Irrigação",{"$f":"Tecno!B21","v":0},{"$f":"Tecno!C21","v":0},{"$f":"B21*Componentes!$J$12+C21*Componentes!$J$13","v":0},{"$f":"IF(Tecno!E21<>\"\",Tecno!E21,\"\")","v":""},{"$f":"Tecno!F21","v":0},null,{"$f":"IF(Tecno!H21<>\"\",Tecno!H21,\"\")","v":""},{"$f":"1.31*Componentes!J31","v":57.558125000000004},{"$f":"D21+G21+I21","v":57.558125000000004}]
["Levantamento Sobrevivência",{"$f":"Tecno!B22","v":0},{"$f":"Tecno!C22","v":0},{"$f":"B22*Componentes!$J$12+C22*Componentes!$J$13","v":0},{"$f":"IF(Tecno!E22<>\"\",Tecno!E22,\"\")","v":""},{"$f":"Tecno!F22","v":0},null,{"$f":"IF(Tecno!H22<>\"\",Tecno!H22,\"\")","v":""},null,{"$f":"D22+G22+I22","v":0}]
["Replantio",{"$f":"Tecno!B23","v":0},{"$f":"Tecno!C23","v":0},{"$f":"B23*Componentes!$J$12+C23*Componentes!$J$13","v":0},{"$f":"IF(Tecno!E23<>\"\",Tecno!E23,\"\")","v":""},{"$f":"Tecno!F23","v":0},null,{"$f":"IF(Tecno!H23<>\"\",Tecno!H23,\"\")","v":""},{"$f":"Componentes!J39*C23","v":0},{"$f":"D23+G23+I23","v":0}]
["Adubação cobertura",null,null,null,null,null,null,null,null,{"$f":"D24+G24+I24","v":0}]
["Primeira Manutenção",null,null,null,null,null,null,null,null,{"$f":"SUM(J10:J24)+Componentes!$H$4","v":2096.0187222696245}]
[]
["Conservação do Solo",{"$f":"Tecno!B27","v":0},{"$f":"Tecno!C27","v":0},{"$f":"B27*Componentes!$J$12+C27*Componentes!$J$13","v":0},{"$f":"IF(Tecno!E27<>\"\",Tecno!E27,\"\")","v":""},{"$f":"Tecno!F27","v":0},null,{"$f":"IF(Tecno!H27<>\"\",Tecno!H27,\"\")","v":""},{"$f":"Componentes!$J$29*C27","v":0},{"$f":"D27+G27+I27","v":0}]
["Controle Químico Linha ",{"$f":"Tecno!B28","v":6},{"$f":"Tecno!C28","v":0},{"$f":"B28*Componentes!$J$12+C28*Componentes!$J$13","v":85.499999999999986},{"$f":"IF(Tecno!E28<>\"\",Tecno!E28,\"\")","v":"Round up"},{"$f":"Tecno!F28","v":0.94},{"$f":"F28*Componentes!$E$56","v":63.778999999999989},{"$f":"IF(Tecno!H28<>\"\",Tecno!H28,\"\")","v":"Pulverizador costal motorizado"},{"$f":"Componentes!J23*B28","v":21.3675},170.64649999999997]
["Controle Químico Entrelinha",{"$f":"Tecno!B29","v":0},{"$f":"Tecno!C29","v":0},{"$f":"B29*Componentes!$J$12+C29*Componentes!$J$13","v":0},{"$f":"IF(Tecno!E29<>\"\",Tecno!E29,\"\")","v":""},{"$f":"Tecno!F29","v":0},{"$f":"F29*Componentes!$E$56","v":0},{"$f":"IF(Tecno!H29<>\"\",Tecno!H29,\"\")","v":""},{"$f":"Componentes!$J$31*C29","v":0},0]
["Controle de formigas",{"$f":"Tecno!B30","v":1.8},{"$f":"Tecno!C30","v":0},{"$f":"B30*Componentes!$J$12+C30*Componentes!$J$13","v":25.65},{"$f":"IF(Tecno!E30<>\"\",Tecno!E30,\"\")","v":"Formicida granulado"},{"$f":"Tecno!F30","v":0.7},{"$f":"F30*Componentes!$E$55","v":30.869999999999997},{"$f":"IF(Tecno!H30<>\"\",Tecno!H30,\"\")","v":"Caminhão + Carreta 4 ton."},null,56.519999999999996]
["Adubação de reforço manual",null,null,null,null,null,null,{"$f":"IF(Tecno!H31<>\"\",Tecno!H31,\"\")","v":""},null,0]
["Manutenção de Aceiros",{"$f":"Tecno!B32","v":0},{"$f":"Tecno!C32","v":0},{"$f":"B32*Componentes!$J$12+C32*Componentes!$J$13","v":0},{"$f":"IF(Tecno!E32<>\"\",Tecno!E32,\"\")","v":""},{"$f":"Tecno!F32","v":0},null,{"$f":"IF(Tecno!H32<>\"\",Tecno!H32,\"\")","v":""},{"$f":"Componentes!$J$29*C32","v":0},0]
["Segunda Manutenção",null,null,null,null,null,null,null,null,{"$f":"SUM(J27:J32)+Componentes!$H$4","v":427.16649999999998}]
[]
["Controle Químico Entrelinha",{"$f":"Tecno!B35","v":0},{"$f":"Tecno!C35","v":0},{"$f":"B35*Componentes!$J$12+C35*Componentes!$J$13","v":0},{"$f":"IF(Tecno!E35<>\"\",Tecno!E35,\"\")","v":""},{"$f":"Tecno!F35","v":0},{"$f":"F35*Componentes!$E$56","v":0},{"$f":"IF(Tecno!H35<>\"\",Tecno!H35,\"\")","v":""},{"$f":"Componentes!$J$31*C35","v":0},{"$f":"D35+G35+I35","v":0}]
["Fosfatagem",null,null,null,null,null,null,null,null,{"$f":"D36+G36+I36","v":0}]
["Roçada Manual Linha",{"$f":"Tecno!B37","v":8},{"$f":"Tecno!C37","v":0},{"$f":"B37*Componentes!$J$12+C37*Componentes!$J$13","v":113.99999999999999},{"$f":"IF(Tecno!E37<>\"\",Tecno!E37,\"\")","v":""},{"$f":"Tecno!F37","v":0},null,{"$f":"IF(Tecno!H37<>\"\",Tecno!H37,\"\")","v":""},null,{"$f":"D37+G37+I37","v":113.99999999999999}]
["Patrolamento Aceiro",{"$f":"Tecno!B38","v":0},{"$f":"Tecno!C38","v":0},{"$f":"B38*Componentes!$J$12+C38*Componentes!$J$13","v":0},{"$f":"IF(Tecno!E38<>\"\",Tecno!E38,\"\")","v":""},{"$f":"Tecno!F38","v":0},null,{"$f":"IF(Tecno!H38<>\"\",Tecno!H38,\"\")","v":""},{"$f":"Componentes!$J$28*C38","v":0},{"$f":"D38+G38+I38","v":0}]
["Terceira Manutenção",null,null,null,null,null,null,null,null,{"$f":"SUM(J35:J38)+Componentes!$H$4","v":314}]
[]
["Controle Químico Entrelinha",{"$f":"Tecno!B41","v":0},{"$f":"Tecno!C41","v":0},{"$f":"B41*Componentes!$J$12+C41*Componentes!$J$13","v":0},{"$f":"IF(Tecno!E41<>\"\",Tecno!E41,\"\")","v":""},{"$f":"Tecno!F41","v":0},{"$f":"F41*Componentes!$E$56","v":0},{"$f":"IF(Tecno!H41<>\"\",Tecno!H41,\"\")","v":""},{"$f":"Componentes!$J$31*C41","v":0},{"$f":"D41+G41+I41","v":0}]
["Adubação de Manutenção",null,null,null,null,null,null,null,null,{"$f":"D42+G42+I42","v":0}]
["Controle formiga manutenção",{"$f":"Tecno!B43","v":1.4},{"$f":"Tecno!C43","v":0},{"$f":"B43*Componentes!$J$12+C43*Componentes!$J$13","v":19.949999999999996},{"$f":"IF(Tecno!E43<>\"\",Tecno!E43,\"\")","v":"Formicida granulado"},{"$f":"Tecno!F43","v":0.6},{"$f":"F43*Componentes!$E$55","v":26.46},{"$f":"IF(Tecno!H43<>\"\",Tecno!H43,\"\")","v":""},null,{"$f":"D43+G43+I43","v":46.41}]
["Patrolamento Aceiro",{"$f":"Tecno!B44","v":0},{"$f":"Tecno!C44","v":0},{"$f":"B44*Componentes!$J$12+C44*Componentes!$J$13","v":0},{"$f":"IF(Tecno!E44<>\"\",Tecno!E44,\"\")","v":""},{"$f":"Tecno!F44","v":0},null,{"$f":"IF(Tecno!H44<>\"\",Tecno!H44,\"\")","v":""},{"$f":"Componentes!$J$28*C44","v":0},{"$f":"D44+G44+I44","v":0}]
["Demais Manutenções",null,null,null,null,null,null,null,null,{"$f":"SUM(J41:J44)+Componentes!$H$4","v":246.41}]
[]
["Controle formiga manutenção",{"$f":"Tecno!B47","v":1.4},{"$f":"Tecno!C47","v":0},{"$f":"B47*Componentes!$J$12+C47*Componentes!$J$13","v":19.949999999999996},{"$f":"IF(Tecno!E47<>\"\",Tecno!E47,\"\")","v":"Formicida granulado"},{"$f":"Tecno!F47","v":0.6},{"$f":"F47*Componentes!$E$55","v":26.46},{"$f":"IF(Tecno!H47<>\"\",Tecno!H47,\"\")","v":""},null,{"$f":"D47+G47+I47","v":46.41}]
["Patrolamento Aceiro",{"$f":"Tecno!B48","v":0},{"$f":"Tecno!C48","v":0},{"$f":"B48*Componentes!$J$12+C48*Componentes!$J$13","v":0},{"$f":"IF(Tecno!E48<>\"\",Tecno!E48,\"\")","v":""},{"$f":"Tecno!F48","v":0},null,{"$f":"IF(Tecno!H48<>\"\",Tecno!H48,\"\")","v":""},{"$f":"Componentes!$J$28*C48","v":0},{"$f":"D48+G48+I48","v":0}]
[null,null,null,null,null,null,null,null,null,{"$f":"SUM(J47:J48)+Componentes!$H$4","v":246.41}]
["Primeiro Desbaste"]
[null,"Ano:",8]
["Marcação",{"$f":"Tecno!$B$62","v":12},null,{"$f":"B52*Componentes!$J$12","v":170.99999999999997},null,null,null,null,null,{"$f":"D52+G52+I52","v":170.99999999999997}]
["Desrama",{"$f":"Tecno!$B$62","v":12},null,{"$f":"B53*Componentes!$J$12","v":170.99999999999997},null,null,null,{"$f":"IF(Tecno!H53<>\"\",Tecno!H53,\"\")","v":""},null,{"$f":"D53+G53+I53","v":170.99999999999997}]
[null,null,null,null,null,null,null,null,null,{"$f":"SUM(J52:J53)","v":341.99999999999994}]
["Segundo Desbaste"]
[null,"Ano:",12]
["Marcação",{"$f":"Tecno!$B$62*1.2","v":14.399999999999999},null,{"$f":"B57*Componentes!$J$12","v":205.19999999999996},null,null,null,null,null,{"$f":"D57+G57+I57","v":205.19999999999996}]
["Desrama",{"$f":"Tecno!$B$62*1.2","v":14.399999999999999},null,{"$f":"B58*Componentes!$J$12","v":205.19999999999996},null,null,null,{"$f":"IF(Tecno!H58<>\"\",Tecno!H58,\"\")","v":""},null,{"$f":"D58+G58+I58","v":205.19999999999996}]
[null,null,null,null,null,null,null,null,null,{"$f":"SUM(J57:J58)","v":410.39999999999992}]
["Corte Raso"]
[null,"Ano:",18]
["Patrolamento Estradas",null,{"$f":"Tecno!C48","v":0},{"$f":"(C62*Componentes!J13)*4","v":0},null,null,null,{"$f":"Tecno!H48","v":0},null,{"$f":"D62+G62+I62","v":0}]
[null,null,null,null,null,null,null,null,null,{"$f":"SUM(J62)","v":0}]