{"text_format":"1","workbook":"xlsx","n_sheets":7,"sheets":["Sorteio","Lista","Troca DI","Troca DE","Troca MT","Troca AA","Troca TG"],"not_rendered":{"charts":0,"images":1,"macros":1,"external_links":0,"defined_names":0,"comments":0,"pivot_tables":0},"unopened":[],"bounds":{"document_bytes":16777216,"sheet_cells":100000,"rows_first":2000,"rows_last":500,"rows_between":2000,"halvings":0,"cell_chars":16384,"cell_head_chars":4096},"cells_cut":0,"cells_raw":0,"read":"whole","date_system":"1900"}

{"sheet":"Sorteio","index":0,"n_rows":28,"n_cols":11,"rows_kept":28,"cut":false,"hidden":false,"merged":[[0,1,0,9]]}
[null,"Jogo do Sistema Terra"]
[]
[]
[]
[]
[null,"Processos da Dinâmica Interna",null,"Processos da Dinâmica Externa",null,"Materiais Terrestres",null,"Ações Antrópicas",null,"Tempo Geológico"]
[]
[null,"Palavra sorteada ",null,"Palavra sorteada ",null,"Palavra sorteada  1",null,"Palavra sorteada ",null,"Palavra sorteada "]
[]
[null,{"$f":"Lista!D22","v":0},null,null,null,null,null,null,null,{"$f":"Lista!L22","v":0}]
[]
[null,null,null,null,null,"Palavra sorteada 2"]
[]
[]
[]
[]
[]
[]
[]
[null,null,null,null,null,null,null,null,null,null,{"$f":"Lista!M32","v":0}]
[]
[]
[null,{"$f":"Lista!D35","v":0}]
[null,{"$f":"Lista!D36","v":0}]
[]
[]
[]
[null,null,null,{"$f":"Lista!F40","v":0}]

{"sheet":"Lista","index":1,"n_rows":23,"n_cols":8,"rows_kept":23,"cut":false,"hidden":true,"merged":[]}
[]
["Ordem","Aleatório",null,"Processos da dinâmica interna","Processos da dinâmica externa","Materiais terrestres","Ação do homem","Tempo geológico"]
[{"$f":"_xlfn.RANK.EQ(B3,$B$3:$B$18)","v":11},{"$f":"RAND()","v":0.4862865903964142},1,"Deformação dúctil","Intemperismo químico","Quartzito","Resíduos sólidos","Registro climático"]
[{"$f":"_xlfn.RANK.EQ(B4,$B$3:$B$18)","v":5},{"$f":"RAND()","v":0.82898007191311662},2,"Plutonismo","Gelo","Ardósia","Meio ambiente","Fanerozóico"]
[8,0.64981034811180105,3,"Subducção","Carste","Granito","Assoreamento","Datação relativa"]
[9,0.64831777090962073,4,"Magnetismo","Diagênese","Argila","Construção civil","Uniformitarismo"]
[14,0.28505323792150961,5,"Placas Tectônicas","Paisagem","Evaporitos","Risco","Anos"]
[12,0.30343515543016408,6,"Manto","Vento","Arenito","Desastres","Fósseis"]
[10,0.5257788804966923,7,"Correntes de convecção","Água","Calcário","Voçorocas","Pre-Cambriano"]
[6,0.81192911361699682,8,"Soerguimento","Lago","Areia","Poluição","Escala"]
[3,0.910820527704998,9,"Litosfera","Mar/ oceano","Basalto","Tecnógeno","Datação absoluta"]
[1,0.99753880776863268,10,"Terremoto/ sismicidade","Erosão","Mármore","Ocupação humana","Antropoceno"]
[16,0.13220026602585733,11,"Relevo","Transporte","Gnaisse","Recursos hídricos","Princ. Horizontalidade Original"]
[4,0.89380609291990121,12,"Deformação rúptil","Intemperismo físico","Minerais félsicos","Combustíveis fósseis","Relações de corte"]
[15,0.14861129297864206,13,"Vulcanismo","Aquífero","Argilominerais","Educação","Princípio Superposição"]
[7,0.70465639897610965,14,"Rifteamento","Sedimentação","Minerais máficos","Recursos minerais","Tempo de meia-vida"]
[2,0.99465823706303025,15,"Subsidência","Rios","BIFs","Áreas contaminadas","Lei da inclusão"]
[13,0.29435321160846561,16,"Orogênese","Escorregamento","Solo","Mapa","Decaimento radioativo"]
[]
[]
[null,1,"sorteado",{"$f":"VLOOKUP($B$21,$A$2:$H$18,4,0)","v":"Terremoto/ sismicidade"},{"$f":"VLOOKUP($B$21,$A$2:$H$18,5,0)","v":"Erosão"},{"$f":"VLOOKUP($B$21,$A$2:$H$18,6,0)","v":"Mármore"},{"$f":"VLOOKUP($B$21,$A$2:$H$18,7,0)","v":"Ocupação humana"},{"$f":"VLOOKUP($B$21,$A$2:$H$18,8,0)","v":"Antropoceno"}]
[null,2]
[null,null,null,null,null,{"$f":"VLOOKUP($B$22,$A$2:$H$18,6,0)","v":"BIFs"}]

{"sheet":"Troca DI","index":2,"n_rows":21,"n_cols":4,"rows_kept":21,"cut":false,"hidden":true,"merged":[]}
[]
["Ordem","Aleatório",null,"Processos da dinâmica interna"]
[{"$f":"_xlfn.RANK.EQ(B3,$B$3:$B$18)","v":7},{"$f":"RAND()","v":0.53861466396549018},1,"Deformação dúctil"]
[{"$f":"_xlfn.RANK.EQ(B4,$B$3:$B$18)","v":12},{"$f":"RAND()","v":0.24132661255302557},2,"Plutonismo"]
[10,0.32637840281981345,3,"Subducção"]
[9,0.39771389239802135,4,"Magnetismo"]
[11,0.30808948242873602,5,"Placas Tectônicas"]
[5,0.62558425608638102,6,"Manto"]
[6,0.61140879458530173,7,"Correntes de convecção"]
[14,0.19906575316172714,8,"Soerguimento"]
[13,0.22137019628652754,9,"Litosfera"]
[8,0.43098289671322731,10,"Terremoto/ sismicidade"]
[2,0.78993704184919999,11,"Relevo"]
[16,2.76954998261566E-2,12,"Deformação rúptil"]
[4,0.67666536761641338,13,"Vulcanismo"]
[15,0.16606815871505409,14,"Rifteamento"]
[3,0.78066555725407683,15,"Subsidência"]
[1,0.96488823111147382,16,"Orogênese"]
[]
[]
[null,1,"sorteado",{"$f":"VLOOKUP($B$21,$A$2:$H$18,4,0)","v":"Orogênese"}]

{"sheet":"Troca DE","index":3,"n_rows":21,"n_cols":4,"rows_kept":21,"cut":false,"hidden":true,"merged":[]}
[]
["Ordem","Aleatório",null,"Processos da dinâmica externa"]
[{"$f":"_xlfn.RANK.EQ(B3,$B$3:$B$18)","v":7},{"$f":"RAND()","v":0.4601134696386191},1,"Intemperismo químico"]
[{"$f":"_xlfn.RANK.EQ(B4,$B$3:$B$18)","v":15},{"$f":"RAND()","v":9.8554899648847227E-3},2,"Gelo"]
[13,0.22275285221827668,3,"Carste"]
[16,6.914204118848577E-3,4,"Diagênese"]
[4,0.76418307710061673,5,"Paisagem"]
[6,0.75748873882063494,6,"Vento"]
[1,0.96720085524502553,7,"Água"]
[14,4.3316459059057233E-2,8,"Lago"]
[3,0.82361192742151734,9,"Mar/ oceano"]
[12,0.22626125268371233,10,"Erosão"]
[10,0.31788834393110466,11,"Transporte"]
[9,0.34007841514023607,12,"Intemperismo físico"]
[8,0.4078618247465372,13,"Aquífero"]
[11,0.23819998843735823,14,"Sedimentação"]
[2,0.85760836308834942,15,"Rios"]
[5,0.7632481519888904,16,"Escorregamento"]
[]
[]
[null,1,"sorteado",{"$f":"VLOOKUP($B$21,$A$2:$H$18,4,0)","v":"Água"}]

{"sheet":"Troca MT","index":4,"n_rows":21,"n_cols":4,"rows_kept":21,"cut":false,"hidden":true,"merged":[]}
[]
["Ordem","Aleatório",null,"Materiais terrestres"]
[{"$f":"_xlfn.RANK.EQ(B3,$B$3:$B$18)","v":4},{"$f":"RAND()","v":0.7450575084355362},1,"Quartzito"]
[{"$f":"_xlfn.RANK.EQ(B4,$B$3:$B$18)","v":8},{"$f":"RAND()","v":0.3900386381067712},2,"Ardósia"]
[10,0.29792768754723287,3,"Granito"]
[6,0.64293644680453443,4,"Argila"]
[2,0.77996116128183701,5,"Evaporitos"]
[9,0.32755372849578224,6,"Arenito"]
[3,0.77129335580647929,7,"Calcário"]
[16,5.997234176136601E-2,8,"Areia"]
[5,0.66663803781630226,9,"Basalto"]
[15,8.0688913946151408E-2,10,"Mármore"]
[14,0.13860426874605158,11,"Gnaisse"]
[11,0.29674876011647533,12,"Minerais félsicos"]
[1,0.79592728163425142,13,"Argilominerais"]
[12,0.23323555788435768,14,"Minerais máficos"]
[7,0.44653016082645902,15,"BIFs"]
[13,0.17570437456124577,16,"Solo"]
[]
[]
[null,1,"sorteado",{"$f":"VLOOKUP($B$21,$A$2:$H$18,4,0)","v":"Argilominerais"}]

{"sheet":"Troca AA","index":5,"n_rows":21,"n_cols":4,"rows_kept":21,"cut":false,"hidden":true,"merged":[]}
[]
["Ordem","Aleatório",null,"Ação do homem"]
[{"$f":"_xlfn.RANK.EQ(B3,$B$3:$B$18)","v":7},{"$f":"RAND()","v":0.70726327029570613},1,"Resíduos sólidos"]
[{"$f":"_xlfn.RANK.EQ(B4,$B$3:$B$18)","v":8},{"$f":"RAND()","v":0.69946780612057191},2,"Meio ambiente"]
[5,0.79514441006396541,3,"Assoreamento"]
[4,0.85750387108901738,4,"Construção civil"]
[3,0.95308357413458733,5,"Risco"]
[9,0.69850556003406239,6,"Desastres"]
[16,1.9578892247996027E-2,7,"Voçorocas"]
[15,8.7116941362759381E-2,8,"Poluição"]
[12,0.46003037807568226,9,"Tecnógeno"]
[6,0.72771568062945158,10,"Ocupação humana"]
[11,0.49535230220784632,11,"Recursos hídricos"]
[1,0.99883928389989218,12,"Combustíveis fósseis"]
[10,0.59333433888690756,13,"Educação"]
[13,0.25113973058649208,14,"Recursos minerais"]
[14,0.1839006637752516,15,"Áreas contaminadas"]
[2,0.98577851103797298,16,"Mapa"]
[]
[]
[null,1,"sorteado",{"$f":"VLOOKUP($B$21,$A$2:$H$18,4,0)","v":"Combustíveis fósseis"}]

{"sheet":"Troca TG","index":6,"n_rows":21,"n_cols":4,"rows_kept":21,"cut":false,"hidden":true,"merged":[]}
[]
["Ordem","Aleatório",null,"Tempo geológico"]
[{"$f":"_xlfn.RANK.EQ(B3,$B$3:$B$18)","v":8},{"$f":"RAND()","v":0.54207511582170353},1,"Registro climático"]
[{"$f":"_xlfn.RANK.EQ(B4,$B$3:$B$18)","v":9},{"$f":"RAND()","v":0.43200057874476516},2,"Fanerozóico"]
[5,0.90063045638132611,3,"Datação relativa"]
[7,0.77690331555396563,4,"Uniformitarismo"]
[10,0.41075017026251137,5,"Anos"]
[14,0.14062212811532337,6,"Fósseis"]
[4,0.91189438037108472,7,"Pre-Cambriano"]
[15,5.1214707388534508E-2,8,"Escala"]
[2,0.94402699953980318,9,"Datação absoluta"]
[13,0.19828168856567341,10,"Antropoceno"]
[6,0.77843592204811241,11,"Princ. Horizontalidade Original"]
[16,3.7259785765304532E-3,12,"Relações de corte"]
[12,0.22952633557588598,13,"Princípio Superposição"]
[11,0.35768115085121399,14,"Tempo de meia-vida"]
[3,0.93044098006190745,15,"Lei da inclusão"]
[1,0.95556230157525635,16,"Decaimento radioativo"]
[]
[]
[null,1,"sorteado",{"$f":"VLOOKUP($B$21,$A$2:$H$18,4,0)","v":"Decaimento radioativo"}]