{"text_format":"1","workbook":"xlsx","n_sheets":4,"sheets":["Energy Index","Calculation sheet","Energy index data","Macro1"],"not_rendered":{"charts":0,"images":0,"macros":0,"external_links":0,"defined_names":6,"comments":0,"pivot_tables":0},"unopened":[],"bounds":{"document_bytes":16777216,"sheet_cells":100000,"rows_first":2000,"rows_last":500,"rows_between":2000,"halvings":0,"cell_chars":16384,"cell_head_chars":4096},"cells_cut":0,"cells_raw":0,"read":"whole","date_system":"1900"}

{"sheet":"Energy Index","index":0,"n_rows":37,"n_cols":22,"rows_kept":37,"cut":false,"hidden":false,"merged":[]}
[]
[null,"Energy index",null,null,null,null,null,null,null,null,null,"PROJECT INFORMATION"]
[]
[null,"Project Name :",null,null,null,"Obstruction angle, degrees :",null,null,null,null,null,27,3,"Internal gains (kWh)",null,null,null,null,null,3000]
[null,"Dwelling type :",null,"flat",1,"Floor to ceiling height (m)",null,null,null,null,null,2.4,null,"Aditional intern. gains (kWh)",null,null,null,null,null,0]
[null,"Location :",null,"LONDON",2,"Ventilation rate (ac/h)",null,null,null,null,null,0.2,4,"Fuel type :",null,null,null,null,null,"Gas"]
[null,"Latitude :",null,{"$f":"VLOOKUP(D6,'Energy index data'!A7:R18,2,)","v":"51°28'"},null,"Volume (m³)",null,null,null,null,null,{"$f":"L5*D10","v":128.4},null,"Mean whole house temperature (°C)",null,null,null,null,null,18.5]
[null,"Mean temp (°C)",null,{"$f":"VLOOKUP(D6,'Energy index data'!A7:R18,3,)","v":10.6},null,"Window / floor ratio, overall (%)",null,null,null,null,null,{"$f":"SUM(J10:J14)*100/D10","v":43.514018691588788},null,{"$f":"IF(L8<10,\"TOO DARK - INCREASE WINDOW AREA\",0)","v":0}]
[null,{"$f":"IF('Calculation sheet'!O41=\"Check location\",\"CHECK LOCATION\",0)","v":0},null,"Area (m²)",null,"U-value (W/m²K)",null,"Windows",null,"Area (m²)",null,"U-value (W/m²K)",null,"Net area (m²)",null,"SG, DG or LE",null,"Window / floor ratio, 10 - 50%",null,"Floor reflectance, 0.20 - 0.80",null,"Net solar gain, kWh"]
[null,"Floor (total)",null,53.5,null,null,null,"North",null,0,null,null,null,{"$f":"0.8*J10","v":0},null,null,null,null,null,0,null,{"$f":"IF(J10=0,0,ROUND('Calculation sheet'!O30,))","v":0}]
[null,"Ground floor",null,null,null,null,null,"NE/NW",null,null,null,null,null,0,null,null,null,null,null,null,null,{"$f":"IF(J11=0,0,ROUND('Calculation sheet'!O31,))","v":0}]
[null,"Walls (gross)",null,41,null,0.23,null,"E/W",null,4.9000000000000004,null,1.4,null,{"$f":"0.8*J12","v":3.9200000000000004},null,"LE",null,25,null,0.5,null,{"$f":"IF(J12=0,0,ROUND('Calculation sheet'!O32,))","v":701}]
[null,"Roof",null,null,null,null,null,"SE/SW",null,1.48,null,1.4,null,0,null,"LE",null,9,null,0.5,null,{"$f":"IF(J13=0,0,ROUND('Calculation sheet'!O33,))","v":317}]
[null,"Other",null,0,null,0,null,"South",null,16.899999999999999,null,1.4,null,{"$f":"0.8*J14","v":13.52},null,"LE",null,42,null,0.5,null,{"$f":"IF(J14=0,0,ROUND('Calculation sheet'!O34,))","v":3463}]
[null,null,null,null,null,null,null,"total",null,{"$f":"SUM(J10:J14)","v":23.28},null,{"$f":"IF(SUM(J10:J14)>D12, \"ERROR: WINDOW AREA LARGER THAN WALL AREA!\",0)","v":0},null,null,null,null,null,null,null,".",null,{"$f":"SUM(V10:V14)","v":4481}]
[null,null,null,"Mean U-value",null,{"$f":"(H19-(0.33*L7*L6))/(D12+D13+D11+D14)","v":0.89433170731707312}]
[null,null,null,"(W/m²K)",null,null,null,null,null,null,null,"RESULTS"]
[null,null,null,null,null,null,null,"total",null,"per m²",null,null,null,"CO2, kg",null,"CO2 kg/m2"]
[null,"Building heat loss coefficient, W/K",null,null,null,null,null,{"$f":"'Calculation sheet'!O15","v":45.142000000000003},null,{"$f":"'Calculation sheet'!O16","v":0.84377570093457954},null,null,null,null,null,null,"Excess gains, kWh",null,null,null,null,{"$f":"IF('Calculation sheet'!O69>0,'Calculation sheet'!O69,0)","v":3559.9994246144652}]
[null,"Annual heat loss, kWh",null,null,null,null,null,{"$f":"'Calculation sheet'!O24","v":3124.0069680000006},null,null,null,null,null,null,null,null,"Peak temperature, ºC",null,null,null,null,{"$f":"'Calculation sheet'!O72","v":29.4}]
[null,"Total internal gains, kWh",null,null,null,null,null,{"$f":"'Calculation sheet'!O37","v":3000},null,null,null,null,null,null,null,null,"Number of hours above 27ºC",null,null,null,null,{"$f":"'Calculation sheet'!O73","v":128}]
[null,"Total net solar gains, kWh",null,null,null,null,null,{"$f":"V15","v":4481}]
[null,"Total annual heat gains, kWh",null,null,null,null,null,{"$f":"'Calculation sheet'!O39","v":7481.1291253132795},null,null,null,null,null,null,null,null,null,null,null,null,null,{"$f":"IF(V19<=5000,0,IF(V19>10000,\"EXCESS GAINS OUT OF THE RANGE\",\"EXCESS GAINS ARE EXTRAPOLATED AND HAVE NOT BEEN VERIFIED\"))","v":0}]
[null,"Gains to Loss Ratio (GLR)",null,null,null,null,null,{"$f":"'Calculation sheet'!O43","v":2.394722291577577}]
[null,"Auxiliary Heating Fraction (AHF)",null,null,null,null,null,{"$f":"'Calculation sheet'!O41","v":0.12469362141726005},null,null,null,null,null,null,null,null,"comments"]
[null,"Continuous heating, kWh (useful)",null,null,null,null,null,{"$f":"ROUND('Calculation sheet'!O49,)","v":390},null,{"$f":"'Calculation sheet'!O50","v":7.2811914424798978},null,null,null,{"$f":"'Calculation sheet'!O61","v":81.80418585626164},null,{"$f":"N26/D10","v":1.5290502029207784},null,"Birken Flat"]
[]
[null,"Intermittent heating, kWh (useful)",null,null,null,null,null,{"$f":"ROUND('Calculation sheet'!O53,)","v":331},null,{"$f":"'Calculation sheet'!O54","v":6.1890127261079124},null,null,null,{"$f":"'Calculation sheet'!O64","v":69.533557977822383},null,{"$f":"N28/D10","v":1.2996926724826614}]
[null,null,null,null,null,null,null,null,null,{"$f":"H29/D10","v":0}]
[]
[null,"ENERGY INDEX © S. YANNAS 1994 WORKSHEET M. DOBRIN & S.YANNAS 1996-2011 "]
[null,"HOW TO USE THE WORKSHEET AND INTERPRET RESULTS: SEE \"SOLAR ENERGY AND HOUSING DESIGN\" VOLUME 1 PART IV,  AA PUBLICATIONS 1994 "]
[]
[1,"Detached, semi-detached, small house or a flat"]
[2,"Pymouth, London, Aberporth, Cambridge, Birmingham, Sheffield, Belfast, Newcastle, Glasgow, Aberdeen"]
[3,"Obstruction angle affects all orientations"]
[4,"If not specified, 0.75 is used as a default"]

{"sheet":"Calculation sheet","index":1,"n_rows":73,"n_cols":16,"rows_kept":73,"cut":false,"hidden":false,"merged":[]}
[]
[null,"CALCULATION STEPS"]
["Step 1:","Heat Loss Coefficient"]
[]
[null,"ELEMENTS"]
[null,null,null,null,null,null,null,null,"Area (m²)",null,null,"U-value (W/m²K)",null,null,"A x U (W/K)"]
[null,"      Roof",null,null,null,null,null,null,{"$f":"'Energy Index'!D13","v":0},null,"x",{"$f":"IF('Energy Index'!F13>0,'Energy Index'!F13,IF('Energy Index'!D13=0,0,0.45))","v":0},null,"=",{"$f":"I7*L7","v":0}]
[null,"      Windows",null,null,null,null,null,null,{"$f":"IF(SUM('Energy Index'!J10:J14)>'Energy Index'!D12,'Energy Index'!D12,SUM('Energy Index'!J10:J14))","v":23.28},null,"x",{"$f":"O8/I8","v":1.4},null,"=",{"$f":"'Energy Index'!J10*(IF('Energy Index'!L10>0,'Energy Index'!L10,2.7))+'Energy Index'!J11*(IF('Energy Index'!L11>0,'Energy Index'!L11,2.7))+'Energy Index'!J12*(IF('Energy Index'!L12>0,'Energy Index'!L12,2.7))+'Energy Index'!J13*(IF('Energy Index'!L13>0,'Energy Index'!L13,2.7))+'Energy Index'!J14*(IF('Energy Index'!L14>0,'Energy Index'!L14,2.7))","v":32.591999999999999}]
[null,"      Walls (net)",null,null,null,null,null,null,{"$f":"'Energy Index'!D12-I8","v":17.72},null,"x",{"$f":"IF('Energy Index'!F12>0,'Energy Index'!F12,IF('Energy Index'!D12=0,0,0.45))","v":0.23},null,"=",{"$f":"I9*L9","v":4.0755999999999997}]
[null,"      Ground floor",null,null,null,null,null,null,{"$f":"'Energy Index'!D11","v":0},null,"x",{"$f":"IF('Energy Index'!F11>0,'Energy Index'!F11,IF('Energy Index'!D11=0,0,0.45))","v":0},null,"=",{"$f":"(IF('Energy Index'!D11<='Energy Index'!D10,'Energy Index'!D11,'Energy Index'!D10))*L10","v":0}]
[null,"      Other",null,null,null,null,null,null,{"$f":"'Energy Index'!D14","v":0},null,"x",{"$f":"IF('Energy Index'!F14>0,'Energy Index'!F14,IF('Energy Index'!D14=0,0,0.45))","v":0},null,"=",{"$f":"I11*L11","v":0}]
[]
[null,"      Ventilation",null,null,null,null,0.33,"x",{"$f":"'Energy Index'!D10*'Energy Index'!L5","v":128.4},2,"x",{"$f":"IF('Energy Index'!L6>0,'Energy Index'!L6,0.75)","v":0.2},3,"=",{"$f":"G13*I13*L13","v":8.474400000000001}]
[]
[null,"BUILDING HEAT LOSS COEFFICIENT, W/K",null,null,null,null,null,null,null,null,null,"(sum of A x U and ventilation)",null,"=",{"$f":"SUM(O5:O11)+O13","v":45.142000000000003},5]
[null,"      Heat loss per m2 floor area, W/K m2",null,null,null,null,null,null,{"$f":"O15","v":45.142000000000003},5,"÷",{"$f":"'Energy Index'!D10","v":53.5},1,"=",{"$f":"I16/L16","v":0.84377570093457954}]
[]
["Step 2:","Gross Annual Heat Loss"]
[]
[null,"      Mean whole house temperature, ºC",null,null,null,null,null,null,null,null,null,null,null,null,{"$f":"'Energy Index'!T7","v":18.5},6]
[null,"      Mean annual outdoor temperature, ºC (Table 13.2)",null,null,null,null,null,null,null,null,null,null,null,null,{"$f":"VLOOKUP('Energy Index'!D6,'Energy index data'!A7:R18,3,)","v":10.6},7]
[null,"      Mean temperature difference, ºC",null,null,null,null,null,null,{"$f":"O20","v":18.5},6,"-",{"$f":"O21","v":10.6},7,"=",{"$f":"I22-L22","v":7.9},8]
[]
[null,"ANNUAL HEAT LOSS, kWh",null,null,null,null,{"$f":"IF('Energy Index'!D6=\"Athens\",4.32,8.76)","v":8.76},"x",{"$f":"O22","v":7.9},8,"x",{"$f":"O15","v":45.142000000000003},5,"=",{"$f":"G24*I24*O15","v":3124.0069680000006},9]
[]
["Step 3:","Solar and Internal Heat Gains"]
[]
[null,"Window orientation     ","Correction factors",null,"Transmitted radiation (table 13.2)",null,"Fraction unobstructed",null,"Glass area, m2",null,null,"Fraction retained (Table 13.3)",null,null,"Net solar gain, kWh"]
[null,null,"(a)",null,"(b)",null,"(c)",null,"(d)",null,null,"(e)",null,null,"(f)"]
[null,"North",{"$f":"IF(I30=0,0,0.98)","v":0},"x",{"$f":"IF(I30=0,0,(VLOOKUP('Energy Index'!$D$6,'Energy index data'!$A$7:$R$18,IF('Energy Index'!P10=\"SG\",-1,0)+IF('Energy Index'!P10=\"DG\",0,0)+IF('Energy Index'!P10=\"LE\",1,0)+5,)))","v":0},"x",{"$f":"IF(I30=0,0,VLOOKUP('Energy Index'!$L$4,'Energy index data'!$A$119:$B$209,2))","v":0},"x",{"$f":"IF('Energy Index'!N10>0,IF('Energy Index'!N10<='Energy Index'!J10,'Energy Index'!N10,'Energy Index'!J10),'Energy Index'!J10*0.8)","v":0},null,"x",{"$f":"IF('Energy Index'!J10=0,0,(VLOOKUP(IF('Energy Index'!R10=0,IF(SUM('Energy Index'!$J$10:$J$14)*100/'Energy Index'!$D$10>50,50,IF(SUM('Energy Index'!$J$10:$J$14)*100/'Energy Index'!$D$10<10,10,SUM('Energy Index'!$J$10:$J$14)*100/'Energy Index'!$D$10)),IF('Energy Index'!R10>50,50,IF('Energy Index'!R10<10,10,'Energy Index'!R10))),'Energy index data'!$A$69:$N$111,HLOOKUP(IF('Energy Index'!T10=0,0.5,IF('Energy Index'!T10<0.2,0.2,IF('Energy Index'!T10>0.8,0.8,'Energy Index'!T10))),'Energy index data'!$A$69:$N$111,43))))","v":0},null,"=",{"$f":"C30*E30*G30*I30*L30","v":0}]
[null,"NE/NW",{"$f":"IF(I31=0,0,0.9)","v":0},"x",{"$f":"IF(I31=0,0,(VLOOKUP('Energy Index'!$D$6,'Energy index data'!$A$7:$R$18,IF('Energy Index'!P11=\"SG\",-1,0)+IF('Energy Index'!P11=\"DG\",0,0)+IF('Energy Index'!P11=\"LE\",1,0)+8,)))","v":0},"x",{"$f":"IF(I31=0,0,VLOOKUP('Energy Index'!$L$4,'Energy index data'!$A$119:$B$209,2))","v":0},"x",{"$f":"IF('Energy Index'!N11>0,IF('Energy Index'!N11<='Energy Index'!J11,'Energy Index'!N11,'Energy Index'!J11),'Energy Index'!J11*0.8)","v":0},null,"x",{"$f":"IF('Energy Index'!J11=0,0,(VLOOKUP(IF('Energy Index'!R11=0,IF(SUM('Energy Index'!$J$10:$J$14)*100/'Energy Index'!$D$10>50,50,IF(SUM('Energy Index'!$J$10:$J$14)*100/'Energy Index'!$D$10<10,10,SUM('Energy Index'!$J$10:$J$14)*100/'Energy Index'!$D$10)),IF('Energy Index'!R11>50,50,IF('Energy Index'!R11<10,10,'Energy Index'!R11))),'Energy index data'!$A$69:$N$111,HLOOKUP(IF('Energy Index'!T11=0,0.5,IF('Energy Index'!T11<0.2,0.2,IF('Energy Index'!T11>0.8,0.8,'Energy Index'!T11))),'Energy index data'!$A$69:$N$111,43))))","v":0},null,"=",{"$f":"C31*E31*G31*I31*L31","v":0}]
[null,"East/West",{"$f":"IF(I32=0,0,0.8)","v":0.8},"x",{"$f":"IF(I32=0,0,(VLOOKUP('Energy Index'!$D$6,'Energy index data'!$A$7:$R$18,IF('Energy Index'!P12=\"SG\",-1,0)+IF('Energy Index'!P12=\"DG\",0,0)+IF('Energy Index'!P12=\"LE\",1,0)+11,)))","v":329},"x",{"$f":"IF(I32=0,0,VLOOKUP('Energy Index'!$L$4,'Energy index data'!$A$119:$B$209,2))","v":0.81399999999999995},"x",{"$f":"IF('Energy Index'!N12>0,IF('Energy Index'!N12<='Energy Index'!J12,'Energy Index'!N12,'Energy Index'!J12),'Energy Index'!J12*0.8)","v":3.9200000000000004},null,"x",{"$f":"IF('Energy Index'!J12=0,0,(VLOOKUP(IF('Energy Index'!R12=0,IF(SUM('Energy Index'!$J$10:$J$14)*100/'Energy Index'!$D$10>50,50,IF(SUM('Energy Index'!$J$10:$J$14)*100/'Energy Index'!$D$10<10,10,SUM('Energy Index'!$J$10:$J$14)*100/'Energy Index'!$D$10)),IF('Energy Index'!R12>50,50,IF('Energy Index'!R12<10,10,'Energy Index'!R12))),'Energy index data'!$A$69:$N$111,HLOOKUP(IF('Energy Index'!T12=0,0.5,IF('Energy Index'!T12<0.2,0.2,IF('Energy Index'!T12>0.8,0.8,'Energy Index'!T12))),'Energy index data'!$A$69:$N$111,43))))","v":0.83499999999999996},null,"=",{"$f":"C32*E32*G32*I32*L32","v":701.26607935999994}]
[null,"SE/SW",{"$f":"IF(I33=0,0,0.88)","v":0.88},"x",{"$f":"IF(I33=0,0,(VLOOKUP('Energy Index'!$D$6,'Energy index data'!$A$7:$R$18,IF('Energy Index'!P13=\"SG\",-1,0)+IF('Energy Index'!P13=\"DG\",0,0)+IF('Energy Index'!P13=\"LE\",1,0)+14,)))","v":403},"x",{"$f":"IF(I33=0,0,VLOOKUP('Energy Index'!$L$4,'Energy index data'!$A$119:$B$209,2))","v":0.81399999999999995},"x",{"$f":"IF('Energy Index'!N13>0,IF('Energy Index'!N13<='Energy Index'!J13,'Energy Index'!N13,'Energy Index'!J13),'Energy Index'!J13*0.8)","v":1.1839999999999999},null,"x",{"$f":"IF('Energy Index'!J13=0,0,(VLOOKUP(IF('Energy Index'!R13=0,IF(SUM('Energy Index'!$J$10:$J$14)*100/'Energy Index'!$D$10>50,50,IF(SUM('Energy Index'!$J$10:$J$14)*100/'Energy Index'!$D$10<10,10,SUM('Energy Index'!$J$10:$J$14)*100/'Energy Index'!$D$10)),IF('Energy Index'!R13>50,50,IF('Energy Index'!R13<10,10,'Energy Index'!R13))),'Energy index data'!$A$69:$N$111,HLOOKUP(IF('Energy Index'!T13=0,0.5,IF('Energy Index'!T13<0.2,0.2,IF('Energy Index'!T13>0.8,0.8,'Energy Index'!T13))),'Energy index data'!$A$69:$N$111,43))))","v":0.92700000000000005},null,"=",{"$f":"C33*E33*G33*I33*L33","v":316.84259363327993}]
[null,"South",{"$f":"IF(I34=0,0,1)","v":1},"x",{"$f":"IF(I34=0,0,(VLOOKUP('Energy Index'!$D$6,'Energy index data'!$A$7:$R$18,IF('Energy Index'!P14=\"SG\",-1,0)+IF('Energy Index'!P14=\"DG\",0,0)+IF('Energy Index'!P14=\"LE\",1,0)+17,)))","v":419},"x",{"$f":"IF(I34=0,0,VLOOKUP('Energy Index'!$L$4,'Energy index data'!$A$119:$B$209,2))","v":0.81399999999999995},"x",{"$f":"IF('Energy Index'!N14>0,IF('Energy Index'!N14<='Energy Index'!J14,'Energy Index'!N14,'Energy Index'!J14),'Energy Index'!J14*0.8)","v":13.52},null,"x",{"$f":"IF('Energy Index'!J14=0,0,(VLOOKUP(IF('Energy Index'!R14=0,IF(SUM('Energy Index'!$J$10:$J$14)*100/'Energy Index'!$D$10>50,50,IF(SUM('Energy Index'!$J$10:$J$14)*100/'Energy Index'!$D$10<10,10,SUM('Energy Index'!$J$10:$J$14)*100/'Energy Index'!$D$10)),IF('Energy Index'!R14>50,50,IF('Energy Index'!R14<10,10,'Energy Index'!R14))),'Energy index data'!$A$69:$N$111,HLOOKUP(IF('Energy Index'!T14=0,0.5,IF('Energy Index'!T14<0.2,0.2,IF('Energy Index'!T14>0.8,0.8,'Energy Index'!T14))),'Energy index data'!$A$69:$N$111,43))))","v":0.751},null,"=",{"$f":"C34*E34*G34*I34*L34","v":3463.0204523199995}]
[null,"TOTAL ANNUAL SOLAR GAIN, kWh",null,null,null,null,null,null,null,null,null,"sum of column (f)",null,null,{"$f":"SUM(O30:O34)","v":4481.1291253132795},10]
[]
[null,"INTERNAL GAINS, kWh",null,null,null,null,null,null,null,null,null,"(6900 or 5400: see text; plus additional input by user)",null,"=",{"$f":"'Energy Index'!T4+'Energy Index'!T5","v":3000},11]
[]
[null,"TOTAL ANNUAL HEAT GAINS, kWh",null,null,null,null,null,null,{"$f":"O35","v":4481.1291253132795},10,"+",{"$f":"O37","v":3000},11,"=",{"$f":"I39+L39","v":7481.1291253132795},12]
[]
{"$rows_left_out":34}
{"sheet":"Energy index data","index":2,"n_rows":209,"n_cols":26,"rows_kept":209,"cut":false,"hidden":false,"merged":[]}
["Table 13.2. Mean annual outdoor temperature and solar radiation through single (SG), double (DG) and low-emissivity (LE) glazing"]
[]
["Location","Latitude","Temp.",null,null,null,null,null,null,null,null,null,null,"Transmitted solar radiation, kWh/m² year"]
[null,null,"°C",null,"North",null,null,"North-east",null,null,"East and West",null,null,"South-east",null,null,"South"]
[null,null,null,null,null,null,null,"North-west",null,null,null,null,null,"South-west"]
[null,null,null,"SG","DG","LE","SG","DG","LE","SG","DG","LE","SG","DG","LE","SG","DG","LE"]
["Athens","37°58'",12.27,{"$f":"0.8*169","v":135.20000000000002},{"$f":"0.7*169","v":118.3},{"$f":"0.65*169","v":109.85000000000001},0,0,0,{"$f":"0.8*400","v":320},{"$f":"0.7*400","v":280},{"$f":"0.65*400","v":260},0,0,0,{"$f":"0.8*607","v":485.6},420,{"$f":"0.65*600","v":390}]
["London","51°28'",10.6,265.60000000000002,209.79,189,325.76,259.27,233,452.38,365.21,329,553.30999999999995,447.91,403,579.67999999999995,465.49,419]
["Aberporth","52°08'",9.6999999999999993,296.08,233.56,210,371.18,295.55,266,513.24,415.42,374,613.07000000000005,495.54,446,631.38,507.51,457]
["Cambridge","52°20'",9.8000000000000007,277,219,197,340,270,243,470,380,342,573,464,418,600,484,436]
["Birmingham","52°28'",9.5,279.37,219.88,198,338.31,268.45,242,459.82,371.7,335,558.42999999999995,451.17,406,585.47,464.12,418]
["Sheffield","53°23'",9.5,274,216,194,327,261,235,442,356,320,537,434,391,564,454,409]
["Belfast","54°39'",8.9,268.56,211.55,190,326.83999999999997,260.08,234,449.28,363.09,327,550.6,445.92,401,579.29999999999995,467.04,420]
["Newcastle","55°01'",9.1,267.18,210.44,189,323.05,257.48,232,445.96,360.01,324,551.66999999999996,447.21,402,584.1,471.76,425]
["Glasgow","55°52'",8.9,261.03937893789401,206.19331233123313,186,316.56519490254868,251.89101949025493,227,429.41119868637105,347.00689655172403,312,523.9632385120351,425.5436323851203,383,552.27008547008541,447.61809116809115,403]
["Aberdeen","57°12'",7.7,258.25,203.99,184,313.51,249.46,225,436.58,352.8,318,549.20000000000005,446.04,401,589.20000000000005,477.55,430]
[]
["Plymouth","50°22'",10.7,308.02,242.73,218,387.39,308.39999999999998,278,542.91,439.27,395,654.96,530.39,477,677.26,543.91,490]
[]
["Values of b as function of window/floor ratio",null,null,null,null,null,null,null,null,null,null,null,null,null,null,"Figure 13.3: Excess Gains: Peak temperatures and number of hours above 27°C"]
[null,null,null,null,null,null,null,null,null,null,null,null,null,null,null,"Hours>27°C",null,null,null,null,null,null,"Peak Temperature, °C"]
["W / F","South","North","London",null,null,null,null,null,null,null,null,null,null,null,"Excess Gains","South","SW","West",null,null,null,"Excess Gains","South","SW","West"]
[0.1,{"$f":"-0.7623*A23^2-0.7746*A23+1.3952","v":1.310117},{"$f":"-1.9881*A23^2+0.232*A23+1.1799","v":1.183219},{"$f":"-0.9794*A23^2-0.3843*A23+1.1777","v":1.1294759999999999},null,null,null,null,null,null,null,null,null,null,null,0,null,null,null,null,null,null,0]
[0.11,1.3007701700000001,{"$f":"-1.9881*A24^2+0.232*A24+1.1799","v":1.1813639899999999},{"$f":"-0.9794*A24^2-0.3843*A24+1.1777","v":1.1235762599999999},null,null,null,null,null,null,null,null,null,null,null,200,null,null,null,null,null,null,200]
[0.12,1.2912708799999999,1.1791113600000001,1.1174806399999999,null,null,null,null,null,null,null,null,null,null,null,400,null,null,null,null,null,null,400]
[0.13,1.2816191299999999,1.17646111,1.11118914,null,null,null,null,null,null,null,null,null,null,null,600,null,null,null,null,null,null,600]
[0.14000000000000001,1.27181492,1.1734132399999999,1.10470176,null,null,null,null,null,null,null,null,null,null,null,800,null,null,null,null,null,null,800]
[0.15,1.26185825,1.1699677499999999,1.0980185,null,null,null,null,null,null,null,null,null,null,null,1000,null,null,null,null,null,null,1000]
[0.16,1.2517491199999999,1.16612464,1.0911393599999999,null,null,null,null,null,null,null,null,null,null,null,1200,null,null,null,null,null,null,1200]
[0.17,1.2414875300000001,1.16188391,1.0840643399999998,null,null,null,null,null,null,null,null,null,null,null,1400,null,null,null,null,null,null,1400]
[0.18,1.2310734800000001,1.15724556,1.0767934399999999,null,null,null,null,null,null,null,null,null,null,null,1600,null,null,{"$f":"ROUND(-95.892+0.0572591*P31+0.00000643633*P31^2,0)","v":12},null,null,null,1600,null,null,{"$f":"ROUND(24.7132+0.00216684*W31-0.0000000776485*W31^2,1)","v":28}]
[0.19,{"$f":"-0.7623*A32^2-0.7746*A32+1.3952","v":1.22050697},1.15220959,1.06932666,null,null,null,null,null,null,null,null,null,null,null,1800,{"$f":"ROUND(-25.5757-0.0103416*P32+0.0000162917*P32^2,)","v":9},12,28,null,null,null,1800,{"$f":"ROUND(25.1378+0.00146185*W32-0.0000000591501*W32^2,1)","v":27.6},{"$f":"ROUND(24.0035+0.00229225*W32-0.0000000984205*W32^2,1)","v":27.8},28.4]
[0.2,1.2097880000000001,1.146776,1.0616639999999999,null,null,null,null,null,null,null,null,null,null,null,2000,19,{"$f":"ROUND(-127.502+0.0571589*P33+0.00000967962*P33^2,0)","v":26},44,null,null,null,2000,27.8,28.2,28.7]
[0.21,1.19891657,1.14094479,1.05380546,null,null,null,null,null,null,null,null,null,null,null,2200,31,45,61,null,null,null,2200,28.1,28.6,29.1]
[0.22,1.18789268,1.1347159599999999,1.0457510399999999,null,null,null,null,null,null,null,null,null,null,null,2400,43,65,79,null,null,null,2400,28.3,28.9,29.5]
[0.23,1.1767163300000001,1.1280895099999999,1.03750074,null,null,null,null,null,null,null,null,null,null,null,2600,58,87,96,null,null,null,2600,28.5,29.3,29.8]
[0.24,1.1653875199999999,1.12106544,1.0290545600000001,null,null,null,null,null,null,null,null,null,null,null,2800,73,108,115,null,null,null,2800,28.8,29.7,30.2]
[0.25,1.1539062499999999,1.11364375,1.0204124999999999,null,null,null,null,null,null,null,null,null,null,null,3000,90,131,134,null,null,null,3000,29,30,30.5]
[0.26,{"$f":"-0.7623*A39^2-0.7746*A39+1.3952","v":1.1422725200000001},1.1058244399999999,1.0115745599999999,null,null,null,null,null,null,null,null,null,null,null,3200,108,155,153,null,null,null,3200,29.2,30.3,30.9]
[0.27,1.1304863300000001,{"$f":"-1.9881*A40^2+0.232*A40+1.1799","v":1.09760751},{"$f":"-0.9794*A40^2-0.3843*A40+1.1777","v":1.0025407399999999},null,null,null,null,null,null,null,null,null,null,null,3400,128,179,173,null,null,null,3400,29.4,30.7,31.2]
{"$rows_left_out":170}
{"sheet":"Macro1","index":3,"n_rows":5,"n_cols":3,"rows_kept":5,"cut":false,"hidden":false,"merged":[]}
["Print_Energy_Index_Results (r)","Prints_Energy_Index_Calculation_Sheet (s)"]
[{"$f":"PRINT(1,,,1,,,,,,,,2)","v":true},{"$f":"WORKBOOK.UNHIDE(\"Calculation sheet\")","v":{"$error":"#VALUE!"}}]
[{"$f":"RETURN()","v":true},{"$f":"PRINT(1,,,1,,,,,,,,2)","v":true},{"$f":"SELECT(\"R2C1\")","v":true}]
[null,{"$f":"WORKBOOK.HIDE()","v":true}]
[null,{"$f":"RETURN()","v":true},{"$f":"WORKBOOK.SELECT(\"Energy Index\",\"Energy Index\")","v":true}]